{"text_format":"1","workbook":"xlsx","n_sheets":10,"sheets":["1. Stamdata","2. Jord","3. Vand","4. Vand inkl. feltmålinger","5. Luft-Kulrør","6. Luft-Orsarør","7. Luft-ATD","8. Luft-Canister","Fakurering","Klassifikation"],"not_rendered":{"charts":0,"images":2,"macros":1,"external_links":1,"defined_names":28,"comments":3,"pivot_tables":0},"unopened":[],"bounds":{"document_bytes":16777216,"sheet_cells":100000,"rows_first":2000,"rows_last":500,"rows_between":2000,"halvings":0,"cell_chars":16384,"cell_head_chars":4096},"cells_cut":0,"cells_raw":0,"read":"whole","date_system":"1900"}

{"sheet":"1. Stamdata","index":0,"n_rows":51,"n_cols":61,"rows_kept":51,"cut":false,"hidden":false,"merged":[[33,20,34,21],[33,6,33,10],[50,1,50,20],[43,1,44,20],[48,6,48,11],[33,12,33,19],[47,12,47,20],[45,1,45,5],[45,6,45,11],[45,12,45,20],[46,12,46,20],[49,1,49,5],[49,6,49,11],[48,12,48,20],[49,12,49,20],[46,1,46,5],[16,0,16,21],[22,16,22,19],[22,3,22,12],[31,6,31,11],[32,6,32,10],[19,0,19,21],[32,12,32,19],[30,3,30,9],[30,12,30,19],[31,12,31,19],[21,13,21,19],[46,6,46,11],[47,1,47,5],[47,6,47,11],[48,1,48,5],[3,0,4,21],[12,2,12,7],[14,2,14,7],[10,2,10,7],[8,10,8,15],[10,10,10,15],[12,10,12,15],[14,10,14,15],[7,2,7,7],[7,10,7,17],[9,2,9,7],[17,0,17,21],[0,1,1,21],[29,3,29,9],[27,12,27,19],[29,12,29,19],[5,1,5,21],[25,3,25,9],[26,3,26,9],[27,3,27,9],[28,3,28,9],[21,3,21,7],[26,12,26,19],[28,12,28,19],[18,1,18,21],[25,12,25,19],[8,2,8,7],[22,20,22,21]]}
[]
[]
[null,null,null,null,null,null,null,null,null,null,null,null,null,null,null,null,null,null,null,null,null,"Version 19.07.2022"]
["Analyserekvisition Regioner"]
[null,null,null,null,null,null,null,null,null,null,null,null,null,null,null,null,null,null,null,null,null,null,null,null,null,null,null,null,null,null,null,null,null,null,null,null,null,null,null," "]
[null,null,null,null,null,null,null,null,null,null,null,null,null,null,null,null,null,null,null,null,null,null,null,null,null,null,null,null,null,null,null,null,null,null,null,null,null,null,null,null,null,null,null,null,null,null,null,null,null,null,null,null,null,null,null,null,null,null,null,null,"Hovedstaden"]
[null,null,"Analyserekvisitionen består af otte faneblade:",null,null,null,null,null,null,null,null,null,null,null,null,null,null,null,null,null,null,null,null,null,null,null,null,null,null,null,null,null,null,null,null,null,null,null,null,null,null,null,null,null,null,null,null,null,null,null,null,null,null,null,null,null,null,null,null,null,"Midtjylland"]
[null,null,null,null,null,null,null,null,null,null,null,null,null,null,null,null,null,null,null,null,null,null,null,null,null,null,null,null,null,null,null,null,null,null,null,null,null,null,null,null,null,null,null,null,null,null,null,null,null,null,null,null,null,null,null,null,null,null,null,null,"Nordjylland"]
[null,null,"1. STAMDATA",null,null,null,null,null,null,{"$f":"IF(SUM('5. Luft-Kulrør'!G30:O30)>0,$J$16,\"\")","v":""},"5. LUFT, KULRØR",null,null,null,null,null,null,null,null,null,null,null,null,null,null,null,null,null,null,null,null,null,null,null,null,null,null,null,null,null,null,null,null,null,null,null,null,null,null,null,null,null,null,null,null,null,null,null,null,null,"Sjælland"]
[null,null,null,null,null,null,null,null,null,null,null,null,null,null,null,null,null,null,null,null,null,null,null,null,null,null,null,null,null,null,null,null,null,null,null,null,null,null,null,null,null,null,null,null,null,null,null,null,null,null,null,null,null,null,null,null,null,null,null,null,"Syddanmark"]
[null,{"$f":"IF(SUM('2. Jord'!G31:U31)>0,$J$16,\"\")","v":""},"2. JORD",null,null,null,null,null,null,{"$f":"IF(SUM('6. Luft-Orsarør'!G30:O30)>0,$J$16,\"\")","v":""},"6. LUFT, ORSARØR"]
[]
[null,{"$f":"IF(SUM('3. Vand'!M29:AB29)>0,$J$16,\"\")","v":""},"3. VAND",null,null,null,null,null,null,{"$f":"IF(SUM('7. Luft-ATD'!L30:T30)>0,$J$16,\"\")","v":""},"7. LUFT, ATD-RØR"]
[]
[null,{"$f":"IF(SUM('4. Vand inkl. feltmålinger'!M38:AB38)>0,$J$16,\"\")","v":""},"4. VAND inkl. feltmålinger",null,null,null,null,null,null,{"$f":"IF(SUM('8. Luft-Canister'!R30:T30)>0,$J$16,\"\")","v":""},"8. LUFT, CANISTER"]
[null,null,null,null,null,null,null,null,null,"Udfyldt"]
["Den udfyldte analyserekvisition mailes til info.hmb@alsglobal.com i Excel-format"]
[" Ved \"Dag-til-dag\" prøver skal analyserekvisitionen være hos ALS senest kl. 16.00, dog fredag kl. 15.30"]
[]
["Nedenstående oplysninger udfyldes på denne side og overføres automatisk til alle faneblade"]
[]
[null,"Sagsnr.:",null,null,null,null,null,null,"Lokalitetsnr.:"]
[null,"Lokalitetsnavn:",null,null,null,null,null,null,null,null,null,null,null,null,"Region:",null,null,null,null,null," <- Vælg fra\nrullemenu"]
[]
[null,null,null,"Rapportmodtager:",null,null,null,null,null,null,null,null,"Fakturamodtager:"]
[null,"Firma:"]
[null,"Adresse:"]
[null,"Postnr./By:"]
[null,"Kontaktperson:"]
[null,"Telefonnummer:"]
[null,"E-mail | EAN:"]
[null,"Personreference:"]
[null,"Fakturareference:",null,null,null,null,null,null,null,null,null,null,null,null,null,null,null,null,null,null,null,{"$f":"COUNTIF(M32,{\"*57*\"})","v":0}]
[null,"Fakturering:",null,null,null,null,null,null,null,null,null,null,"Månedlig samlefaktura (A)",null,null,null,null,null,null,null," <- Vælg fra\nrullemenu",null,null,null,null,null,null,null,null,null,null,null,null,null,null,null,null,null,null,null,null,"Ugentlig samlefaktura (J)"]
[null,null,null,null,null,null,null,null,null,null,null,null,null,null,null,null,null,null,null,null,null,null,null,null,null,null,null,null,null,null,null,null,null,null,null,null,null,null,null,null,null,"Månedlig samlefaktura (A)"]
[null,null,null,null,null,null,null,null,null,null,null,null,null,null,null,null,null,null,null,null,null,null,null,null,null,null,null,null,null,null,null,null,null,null,null,null,null,null,null,null,null,"Særlig aftale (S)"]
[null,"Emballage og prøveafhentning bestilles på:"]
[null,"https://www.alsglobal.dk/transport-og-emballage"]
[]
[null,"ALS' prøvemodtagelse kan kontaktes på mail og telefon:"]
[null,"E  info.hmb@alsglobal.com"]
[null,"T  4925 0770"]
[]
[null,"Definition af leveringstider"]
[]
[null,"ALS-betegnelse",null,null,null,null,"Regionsbetegnelse",null,null,null,null,null,"Beskrivelse"]
[null,"Normal",null,null,null,null,null,null,null,null,null,null,"Leveringstid i henhold til tilbudsliste"]
[null,"Dag-til-dag",null,null,null,null,"Hasteanalyse",null,null,null,null,null,"Vi bestræber os på at levere den efterfølgende arbejdsdag, men levering anses for rettidig indtil 2. hverdag kl. 9 "]
[null,"Dag-til-dag (P12)",null,null,null,null,"Hastetillæg 2",null,null,null,null,null,"Levering efterfølgende hverdag kl. 12"]
[null,"Dag-til-dag (P9)",null,null,null,null,"Hastetillæg 1",null,null,null,null,null,"Levering efterfølgende hverdag kl. 9"]
[null,"Der kan kun vælges én leveringstid pr. matrix/ordre."]

{"sheet":"2. Jord","index":1,"n_rows":173,"n_cols":40,"rows_kept":173,"cut":false,"hidden":false,"merged":[[58,4,58,5],[56,4,56,5],[50,4,50,5],[51,4,51,5],[54,4,54,5],[68,10,68,11],[59,0,59,1],[60,0,60,1],[59,10,59,11],[60,10,60,11],[66,0,66,1],[54,10,54,11],[52,4,52,5],[55,4,55,5],[61,10,61,11],[62,10,62,11],[64,4,64,5],[64,10,64,11],[63,10,63,11],[52,10,52,11],[58,0,58,1],[53,0,53,1],[59,4,59,5],[60,4,60,5],[53,10,53,11],[40,0,42,1],[31,0,34,1],[35,0,39,1],[50,10,50,11],[48,10,48,11],[31,11,42,11],[43,10,43,11],[42,4,42,5],[31,4,41,5],[44,0,44,1],[45,0,45,1],[46,0,46,1],[47,4,47,5],[48,4,48,5],[49,0,49,1],[49,4,49,5],[47,0,47,1],[48,0,48,1],[46,4,46,5],[50,0,50,1],[44,4,44,5],[45,4,45,5],[45,10,45,11],[31,10,42,10],[169,4,169,5],[169,10,169,11],[61,0,61,1],[63,0,63,1],[62,0,62,1],[43,0,43,1],[53,4,53,5],[47,10,47,11],[52,0,52,1],[61,4,61,5],[57,0,57,1],[81,10,81,11],[80,0,80,1],[80,4,80,5],[145,10,145,11],[149,4,149,5],[158,4,158,5],[158,10,158,11],[159,0,159,1],[151,0,151,1],[152,0,152,1],[148,10,148,11],[150,10,150,11],[146,0,146,1],[171,0,171,1],[172,0,172,1],[168,4,168,5],[168,10,168,11],[163,0,163,1],[164,0,164,1],[165,0,165,1],[163,4,163,5],[163,10,163,11],[164,4,164,5],[169,0,169,1],[170,0,170,1],[168,0,168,1],[166,4,166,5],[167,0,167,1],[171,4,171,5],[171,10,171,11],[172,4,172,5],[172,10,172,11],[164,10,164,11],[170,4,170,5],[170,10,170,11],[165,4,165,5],[165,10,165,11],[147,0,147,1],[146,4,146,5],[146,10,146,11],[147,4,147,5],[147,10,147,11],[161,0,161,1],[162,0,162,1],[166,10,166,11],[154,4,154,5],[154,10,154,11],[155,4,155,5],[155,10,155,11],[156,4,156,5],[156,10,156,11],[158,0,158,1],[166,0,166,1],[160,0,160,1],[162,4,162,5],[162,10,162,11],[160,4,160,5],[160,10,160,11],[161,4,161,5],[161,10,161,11],[159,4,159,5],[159,10,159,11],[154,0,154,1],[155,0,155,1],[149,10,149,11],[149,0,149,1],[150,0,150,1],[148,4,148,5],[157,0,157,1],[153,0,153,1],[151,4,151,5],[151,10,151,11],[152,4,152,5],[152,10,152,11],[153,4,153,5],[153,10,153,11],[156,0,156,1],[150,4,150,5],[157,4,157,5],[157,10,157,11],[142,4,142,5],[114,10,114,11],[124,10,124,11],[125,4,125,5],[125,10,125,11],[121,4,121,5],[132,0,132,1],[132,10,132,11],[129,10,129,11],[130,10,130,11],[133,4,133,5],[133,10,133,11],[134,4,134,5],[134,10,134,11],[136,0,136,1],[137,0,137,1],[135,4,135,5],[135,10,135,11],[136,4,136,5],[136,10,136,11],[137,4,137,5],[137,10,137,11],[135,0,135,1],[138,0,138,1],[139,0,139,1],[140,0,140,1],[138,4,138,5],[138,10,138,11],[139,4,139,5],[139,10,139,11],[141,0,141,1],[141,10,141,11],[31,6,42,6],[83,0,83,1],[84,0,84,1],[88,4,88,5],[105,4,105,5],[113,0,113,1],[112,0,112,1],[108,0,108,1],[107,0,107,1],[106,4,106,5],[105,0,105,1],[112,4,112,5],[109,4,109,5],[110,0,110,1],[110,4,110,5],[111,0,111,1],[102,0,102,1],[94,4,94,5],[103,0,103,1],[94,0,94,1],[99,0,99,1],[101,0,101,1],[109,0,109,1],[108,4,108,5],[56,0,56,1],[86,0,86,1],[87,0,87,1],[71,0,71,1],[76,4,76,5],[104,0,104,1],[100,0,100,1],[73,0,73,1],[89,0,89,1],[68,0,68,1],[67,0,67,1],[92,0,92,1],[97,0,97,1],[98,0,98,1],[88,0,88,1],[90,0,90,1],[51,0,51,1],[90,4,90,5],[85,0,85,1],[91,0,91,1],[96,0,96,1],[95,0,95,1],[93,0,93,1],[96,4,96,5],[63,4,63,5],[74,4,74,5],[67,4,67,5],[82,0,82,1],[82,4,82,5],[79,4,79,5],[75,4,75,5],[69,4,69,5],[69,0,69,1],[72,0,72,1],[70,4,70,5],[70,0,70,1],[76,0,76,1],[81,0,81,1],[79,0,79,1],[78,0,78,1],[77,0,77,1],[32,20,42,20],[6,2,7,6],[31,9,42,9],[25,0,29,20],[24,1,24,20],[30,0,30,1],[30,2,30,5],[32,18,42,18],[11,2,11,6],[31,15,42,15],[31,18,31,20],[31,17,42,17],[31,8,42,8],[31,14,42,14],[20,11,20,19],[21,11,21,19],[22,11,22,19],[14,2,14,8],[14,11,14,19],[21,2,21,4],[9,2,9,6],[58,10,58,11],[32,19,42,19],[3,12,3,19],[56,10,56,11],[57,4,57,5],[57,10,57,11],[3,2,3,6],[74,0,74,1],[75,0,75,1],[65,0,65,1],[64,0,64,1],[68,4,68,5],[74,10,74,11],[75,10,75,11],[66,10,66,11],[67,10,67,11],[69,10,69,11],[65,10,65,11],[72,4,72,5],[72,10,72,11],[73,4,73,5],[73,10,73,11],[66,4,66,5],[65,4,65,5],[54,0,54,1],[55,0,55,1],[4,2,4,11],[4,15,4,19],[18,2,18,8],[19,2,19,8],[15,11,15,19],[16,11,16,19],[17,11,17,19],[18,11,18,19],[19,11,19,19],[16,2,16,8],[31,13,42,13],[31,12,42,12],[55,10,55,11],[15,2,15,8],[30,10,30,11],[31,16,42,16],[17,2,17,8],[10,2,10,6],[44,10,44,11],[31,2,32,3],[33,3,41,3],[33,2,41,2],[49,10,49,11],[46,10,46,11],[43,4,43,5],[51,10,51,11],[31,7,42,7],[142,0,142,1],[148,0,148,1],[121,0,121,1],[120,4,120,5],[145,4,145,5],[106,0,106,1],[133,0,133,1],[134,0,134,1],[128,0,128,1],[130,0,130,1],[116,0,116,1],[111,4,111,5],[122,4,122,5],[115,4,115,5],[132,4,132,5],[131,0,131,1],[129,4,129,5],[130,4,130,5],[131,4,131,5],[126,0,126,1],[127,0,127,1],[129,0,129,1],[115,0,115,1],[143,0,144,20],[76,10,76,11],[77,4,77,5],[117,0,117,1],[118,0,118,1],[119,0,119,1],[117,4,117,5],[145,0,145,1],[117,10,117,11],[118,4,118,5],[123,0,123,1],[124,0,124,1],[125,0,125,1],[114,0,114,1],[77,10,77,11],[78,4,78,5],[120,0,120,1],[141,4,141,5],[105,10,105,11],[140,10,140,11],[114,4,114,5],[113,10,113,11],[95,4,95,5],[124,4,124,5],[121,10,121,11],[167,4,167,5],[167,10,167,11],[106,10,106,11],[95,10,95,11],[110,10,110,11],[99,4,99,5],[115,10,115,11],[116,4,116,5],[116,10,116,11],[112,10,112,11],[111,10,111,11],[109,10,109,11],[108,10,108,11],[97,4,97,5],[100,10,100,11],[101,10,101,11],[107,10,107,11],[119,10,119,11],[140,4,140,5],[107,4,107,5],[126,4,126,5],[127,4,127,5],[128,4,128,5],[113,4,113,5],[131,10,131,11],[126,10,126,11],[127,10,127,11],[128,10,128,11],[123,4,123,5],[123,10,123,11],[122,10,122,11],[70,10,70,11],[71,4,71,5],[71,10,71,11],[85,10,85,11],[86,10,86,11],[87,10,87,11],[84,10,84,11],[91,10,91,11],[86,4,86,5],[78,10,78,11],[91,4,91,5],[82,10,82,11],[80,10,80,11],[81,4,81,5],[88,10,88,11],[79,10,79,11],[83,4,83,5],[83,10,83,11],[84,4,84,5],[90,10,90,11],[89,4,89,5],[89,10,89,11],[85,4,85,5],[87,4,87,5],[62,4,62,5],[177,0,177,1],[177,4,177,5],[177,10,177,11],[173,4,173,5],[173,10,173,11],[174,0,174,1],[174,4,174,5],[174,10,174,11],[175,0,175,1],[175,4,175,5],[175,10,175,11],[176,0,176,1],[176,4,176,5],[176,10,176,11],[173,0,173,1],[122,0,122,1],[31,38,42,38],[31,39,42,39],[142,10,142,11],[120,10,120,11],[118,10,118,11],[119,4,119,5],[104,4,104,5],[100,4,100,5],[101,4,101,5],[92,10,92,11],[93,10,93,11],[102,10,102,11],[103,10,103,11],[104,10,104,11],[94,10,94,11],[99,10,99,11],[98,10,98,11],[96,10,96,11],[97,10,97,11],[98,4,98,5],[102,4,102,5],[103,4,103,5],[93,4,93,5],[92,4,92,5]]}
[]
[null,null,null,null,null,null,null,null,null,null,null,null,null,"Analyserekvisition JORD"]
[]
["Sagsnr.:",null,{"$f":"IF('1. Stamdata'!D22=\"\",\"\",'1. Stamdata'!D22)","v":""},null,null,null,null,"Lokalitetsnr.:",null,null,null,null,{"$f":"IF('1. Stamdata'!N22=\"\",\"\",'1. Stamdata'!N22)","v":""}]
["Lokalitetsnavn:",null,{"$f":"IF('1. Stamdata'!D23=\"\",\"\",'1. Stamdata'!D23)","v":""},null,null,null,null,null,null,null,null,null,null,"Region:",null,{"$f":"IF('1. Stamdata'!Q23=\"\",\"\",'1. Stamdata'!Q23)","v":""}]
[]
[]
["Prøvetager:",null,null,null,null,null,null,null,null,null,"Leveringstid:"]
[null,null,null,null,null,null,null,null,null,null,"Normal:"]
["Udtagningsdato:",null,null,null,null,null,null,null,null,null,"Dag-til-dag"]
["Indleveringsdato:",null,null,null,null,null,null,null,null,null,"Dag-til-dag (P12):"]
["Rekvisitionsdato:",null,null,null,null,null,null,null,null,null,"Dag-til-dag (P9):"]
[]
[null,null,"Rapportmodtager:",null,null,null,null,null,null,null,null,"Fakturamodtager:"]
[{"$f":"'1. Stamdata'!$B$26","v":"Firma:"},null,{"$f":"IF('1. Stamdata'!D26=\"\",\"\",'1. Stamdata'!D26)","v":""},null,null,null,null,null,null,null,null,{"$f":"IF('1. Stamdata'!M26=\"\",\"\",'1. Stamdata'!M26)","v":""}]
[{"$f":"'1. Stamdata'!$B$27","v":"Adresse:"},null,{"$f":"IF('1. Stamdata'!D27=\"\",\"\",'1. Stamdata'!D27)","v":""},null,null,null,null,null,null,null,null,{"$f":"IF('1. Stamdata'!M27=\"\",\"\",'1. Stamdata'!M27)","v":""}]
[{"$f":"'1. Stamdata'!$B$28","v":"Postnr./By:"},null,{"$f":"IF('1. Stamdata'!D28=\"\",\"\",'1. Stamdata'!D28)","v":""},null,null,null,null,null,null,null,null,{"$f":"IF('1. Stamdata'!M28=\"\",\"\",'1. Stamdata'!M28)","v":""}]
[{"$f":"'1. Stamdata'!$B$29","v":"Kontaktperson:"},null,{"$f":"IF('1. Stamdata'!D29=\"\",\"\",'1. Stamdata'!D29)","v":""},null,null,null,null,null,null,null,null,{"$f":"IF('1. Stamdata'!M29=\"\",\"\",'1. Stamdata'!M29)","v":""}]
[{"$f":"'1. Stamdata'!$B$30","v":"Telefonnummer:"},null,{"$f":"IF('1. Stamdata'!D30=\"\",\"\",'1. Stamdata'!D30)","v":""},null,null,null,null,null,null,null,null,{"$f":"IF('1. Stamdata'!M30=\"\",\"\",'1. Stamdata'!M30)","v":""}]
[{"$f":"'1. Stamdata'!$B$31","v":"E-mail | EAN:"},null,{"$f":"IF('1. Stamdata'!D31=\"\",\"\",'1. Stamdata'!D31)","v":""},null,null,null,null,null,null,null,null,{"$f":"IF('1. Stamdata'!M31=\"\",\"\",'1. Stamdata'!M31)","v":""}]
[{"$f":"'1. Stamdata'!$B$32","v":"Personreference:"},null,{"$f":"IF('1. Stamdata'!D32=\"\",\"\",'1. Stamdata'!D32)","v":""},null,null,null,null,null,null,null,null,{"$f":"IF('1. Stamdata'!M32=\"\",\"\",'1. Stamdata'!M32)","v":""}]
[{"$f":"'1. Stamdata'!$B$33","v":"Fakturareference:"},null,null,null,null,null,null,null,null,null,null,{"$f":"IF('1. Stamdata'!M33=\"\",\"\",'1. Stamdata'!M33)","v":""}]
[{"$f":"'1. Stamdata'!$B$34","v":"Fakturering:"},null,null,null,null,null,null,null,null,null,null,{"$f":"IF('1. Stamdata'!M34=\"\",\"\",'1. Stamdata'!M34)","v":"Månedlig samlefaktura (A)"}]
[]
["Bemærkninger:"]
[]
[]
[]
[]
[]
[{"$f":"COUNTA(A44:A143)","v":0},null,"Optælling",null,null,null,{"$f":"COUNTA(G44:G178)","v":0},0,0,0,0,0,{"$f":"COUNTA(M44:M178)","v":0},0,0,0,0,0,{"$f":"COUNTA(S44:S178)","v":0},0,{"$f":"COUNTA(U44:U178)","v":0}]
["* Udtages prøven i én bestemt dybde, skrives dybden i feltet \"Top\"",null,"Dybde\n(m u.t.)",null,"Forbeholdt ALS",null,"Kulbrinter, Reflab 1:2010 (6341)","Kulbrinter og BTEXN, Reflab 1:2010 (6340)","PAH'er, 7 stoffer (Reflab 4:2008) (6289)","ICP pk: Pb, Cd, Cr, Cu, Ni, Zn (5543)","Jordpakke: Kulbrinter (Reflab 1:2010),","PAH'er (Reflab 4:2008) og ICP pk. (6345)","Jordpakke med BTEXN (6344)","Chlorerede opløsningsmidler (5845)","Chlorerede opl. + nedbrydningsprod. (6333)","Kulbrinter, BTEXN og chlorerede (6366)","Kulbrinter, BTEXN, chlor. og nedbr.(6708)","PID måling (5603)","Andet",null,null,null,null,null,null,null,null,null,null,null,null,null,null,null,null,null,null,null,"Dybde \"-\"","Dybde \"_\""]
[]
[null,null,"Prøvens dybde i meter fra terræn til top af prøven","Prøvens dybde i meter fra terræn til bund af prøven"]
[]
["Rekvisition udfyldes med \nén prøve pr. linje"]
[]
[]
[]
[]
["PrøvestedID \n(boringsnr/DGU/\nprøvestedsnavn)"]
[]
[null,null,"*Top","Bund","Labnr."]
[null,null,null,null,null,null,null,null,null,null,null,null,null,null,null,null,null,null,null,null,null,null,null,null,null,null,null,null,null,null,null,null,null,null,null,null,null,null,{"$f":"COUNTIF(C44, {\"*-*\"})-COUNTIF(C44, {\"-*\"})","v":0},{"$f":"COUNTIF(C44, {\"*_*\"})","v":0}]
[null,null,null,null,null,null,null,null,null,null,null,null,null,null,null,null,null,null,null,null,null,null,null,null,null,null,null,null,null,null,null,null,null,null,null,null,null,null,{"$f":"COUNTIF(C45, {\"*-*\"})-COUNTIF(C45, {\"-*\"})","v":0},{"$f":"COUNTIF(C45, {\"*_*\"})","v":0}]
[null,null,null,null,null,null,null,null,null,null,null,null,null,null,null,null,null,null,null,null,null,null,null,null,null,null,null,null,null,null,null,null,null,null,null,null,null,null,{"$f":"COUNTIF(C46, {\"*-*\"})-COUNTIF(C46, {\"-*\"})","v":0},{"$f":"COUNTIF(C46, {\"*_*\"})","v":0}]
[null,null,null,null,null,null,null,null,null,null,null,null,null,null,null,null,null,null,null,null,null,null,null,null,null,null,null,null,null,null,null,null,null,null,null,null,null,null,{"$f":"COUNTIF(C47, {\"*-*\"})-COUNTIF(C47, {\"-*\"})","v":0},{"$f":"COUNTIF(C47, {\"*_*\"})","v":0}]
[null,null,null,null,null,null,null,null,null,null,null,null,null,null,null,null,null,null,null,null,null,null,null,null,null,null,null,null,null,null,null,null,null,null,null,null,null,null,{"$f":"COUNTIF(C48, {\"*-*\"})-COUNTIF(C48, {\"-*\"})","v":0},{"$f":"COUNTIF(C48, {\"*_*\"})","v":0}]
[null,null,null,null,null,null,null,null,null,null,null,null,null,null,null,null,null,null,null,null,null,null,null,null,null,null,null,null,null,null,null,null,null,null,null,null,null,null,{"$f":"COUNTIF(C49, {\"*-*\"})-COUNTIF(C49, {\"-*\"})","v":0},{"$f":"COUNTIF(C49, {\"*_*\"})","v":0}]
[null,null,null,null,null,null,null,null,null,null,null,null,null,null,null,null,null,null,null,null,null,null,null,null,null,null,null,null,null,null,null,null,null,null,null,null,null,null,{"$f":"COUNTIF(C50, {\"*-*\"})-COUNTIF(C50, {\"-*\"})","v":0},{"$f":"COUNTIF(C50, {\"*_*\"})","v":0}]
[null,null,null,null,null,null,null,null,null,null,null,null,null,null,null,null,null,null,null,null,null,null,null,null,null,null,null,null,null,null,null,null,null,null,null," ",null,null,{"$f":"COUNTIF(C51, {\"*-*\"})-COUNTIF(C51, {\"-*\"})","v":0},{"$f":"COUNTIF(C51, {\"*_*\"})","v":0}]
[null,null,null,null,null,null,null,null,null,null,null,null,null,null,null,null,null,null,null,null,null,null,null,null,null,null,null,null,null,null,null,null,null,null,null," ",null,null,{"$f":"COUNTIF(C52, {\"*-*\"})-COUNTIF(C52, {\"-*\"})","v":0},{"$f":"COUNTIF(C52, {\"*_*\"})","v":0}]
[null,null,null,null,null,null,null,null,null,null,null,null,null,null,null,null,null,null,null,null,null,null,null,null,null,null,null,null,null,null,null,null,null,null,null," ",null,null,{"$f":"COUNTIF(C53, {\"*-*\"})-COUNTIF(C53, {\"-*\"})","v":0},{"$f":"COUNTIF(C53, {\"*_*\"})","v":0}]
[null,null,null,null,null,null,null,null,null,null,null,null,null,null,null,null,null,null,null,null,null,null,null,null,null,null,null,null,null,null,null,null,null,null,null,null,null,null,{"$f":"COUNTIF(C54, {\"*-*\"})-COUNTIF(C54, {\"-*\"})","v":0},{"$f":"COUNTIF(C54, {\"*_*\"})","v":0}]
[null,null,null,null,null,null,null,null,null,null,null,null,null,null,null,null,null,null,null,null,null,null,null,null,null,null,null,null,null,null,null,null,null,null,null,null,null,null,{"$f":"COUNTIF(C55, {\"*-*\"})-COUNTIF(C55, {\"-*\"})","v":0},{"$f":"COUNTIF(C55, {\"*_*\"})","v":0}]
[null,null,null,null,null,null,null,null,null,null,null,null,null,null,null,null,null,null,null,null,null,null,null,null,null,null,null,null,null,null,null,null,null,null,null,null,null,null,{"$f":"COUNTIF(C56, {\"*-*\"})-COUNTIF(C56, {\"-*\"})","v":0},{"$f":"COUNTIF(C56, {\"*_*\"})","v":0}]
[null,null,null,null,null,null,null,null,null,null,null,null,null,null,null,null,null,null,null,null,null,null,null,null,null,null,null,null,null,null,null,null,null,null,null,null,null,null,{"$f":"COUNTIF(C57, {\"*-*\"})-COUNTIF(C57, {\"-*\"})","v":0},{"$f":"COUNTIF(C57, {\"*_*\"})","v":0}]
[null,null,null,null,null,null,null,null,null,null,null,null,null,null,null,null,null,null,null,null,null,null,null,null,null,null,null,null,null,null,null,null,null,null,null,null,null,null,{"$f":"COUNTIF(C58, {\"*-*\"})-COUNTIF(C58, {\"-*\"})","v":0},{"$f":"COUNTIF(C58, {\"*_*\"})","v":0}]
[null,null,null,null,null,null,null,null,null,null,null,null,null,null,null,null,null,null,null,null,null,null,null,null,null,null,null,null,null,null,null,null,null,null,null,null,null,null,{"$f":"COUNTIF(C59, {\"*-*\"})-COUNTIF(C59, {\"-*\"})","v":0},{"$f":"COUNTIF(C59, {\"*_*\"})","v":0}]
[null,null,null,null,null,null,null,null,null,null,null,null,null,null,null,null,null,null,null,null,null,null,null,null,null,null,null,null,null,null,null,null,null,null,null,null,null,null,{"$f":"COUNTIF(C60, {\"*-*\"})-COUNTIF(C60, {\"-*\"})","v":0},{"$f":"COUNTIF(C60, {\"*_*\"})","v":0}]
[null,null,null,null,null,null,null,null,null,null,null,null,null,null,null,null,null,null,null,null,null,null,null,null,null,null,null,null,null,null,null,null,null,null,null," ",null,null,{"$f":"COUNTIF(C61, {\"*-*\"})-COUNTIF(C61, {\"-*\"})","v":0},{"$f":"COUNTIF(C61, {\"*_*\"})","v":0}]
[null,null,null,null,null,null,null,null,null,null,null,null,null,null,null,null,null,null,null,null,null,null,null,null,null,null,null,null,null,null,null,null,null,null,null," ",null,null,{"$f":"COUNTIF(C62, {\"*-*\"})-COUNTIF(C62, {\"-*\"})","v":0},{"$f":"COUNTIF(C62, {\"*_*\"})","v":0}]
[null,null,null,null,null,null,null,null,null,null,null,null,null,null,null,null,null,null,null,null,null,null,null,null,null,null,null,null,null,null,null,null,null,null,null," ",null,null,{"$f":"COUNTIF(C63, {\"*-*\"})-COUNTIF(C63, {\"-*\"})","v":0},{"$f":"COUNTIF(C63, {\"*_*\"})","v":0}]
[null,null,null,null,null,null,null,null,null,null,null,null,null,null,null,null,null,null,null,null,null,null,null,null,null,null,null,null,null,null,null,null,null,null,null," ",null,null,{"$f":"COUNTIF(C64, {\"*-*\"})-COUNTIF(C64, {\"-*\"})","v":0},{"$f":"COUNTIF(C64, {\"*_*\"})","v":0}]
[null,null,null,null,null,null,null,null,null,null,null,null,null,null,null,null,null,null,null,null,null,null,null,null,null,null,null,null,null,null,null,null,null,null,null," ",null,null,{"$f":"COUNTIF(C65, {\"*-*\"})-COUNTIF(C65, {\"-*\"})","v":0},{"$f":"COUNTIF(C65, {\"*_*\"})","v":0}]
[null,null,null,null,null,null,null,null,null,null,null,null,null,null,null,null,null,null,null,null,null,null,null,null,null,null,null,null,null,null,null,null,null,null,null," ",null,null,{"$f":"COUNTIF(C66, {\"*-*\"})-COUNTIF(C66, {\"-*\"})","v":0},{"$f":"COUNTIF(C66, {\"*_*\"})","v":0}]
[null,null,null,null,null,null,null,null,null,null,null,null,null,null,null,null,null,null,null,null,null,null,null,null,null,null,null,null,null,null,null,null,null,null,null," ",null,null,{"$f":"COUNTIF(C67, {\"*-*\"})-COUNTIF(C67, {\"-*\"})","v":0},{"$f":"COUNTIF(C67, {\"*_*\"})","v":0}]
[null,null,null,null,null,null,null,null,null,null,null,null,null,null,null,null,null,null,null,null,null,null,null,null,null,null,null,null,null,null,null,null,null,null,null," ",null,null,{"$f":"COUNTIF(C68, {\"*-*\"})-COUNTIF(C68, {\"-*\"})","v":0},{"$f":"COUNTIF(C68, {\"*_*\"})","v":0}]
[null,null,null,null,null,null,null,null,null,null,null,null,null,null,null,null,null,null,null,null,null,null,null,null,null,null,null,null,null,null,null,null,null,null,null," ",null,null,{"$f":"COUNTIF(C69, {\"*-*\"})-COUNTIF(C69, {\"-*\"})","v":0},{"$f":"COUNTIF(C69, {\"*_*\"})","v":0}]
[null,null,null,null,null,null,null,null,null,null,null,null,null,null,null,null,null,null,null,null,null,null,null,null,null,null,null,null,null,null,null,null,null,null,null," ",null,null,{"$f":"COUNTIF(C70, {\"*-*\"})-COUNTIF(C70, {\"-*\"})","v":0},{"$f":"COUNTIF(C70, {\"*_*\"})","v":0}]
[null,null,null,null,null,null,null,null,null,null,null,null,null,null,null,null,null,null,null,null,null,null,null,null,null,null,null,null,null,null,null,null,null,null,null," ",null,null,{"$f":"COUNTIF(C71, {\"*-*\"})-COUNTIF(C71, {\"-*\"})","v":0},{"$f":"COUNTIF(C71, {\"*_*\"})","v":0}]
[null,null,null,null,null,null,null,null,null,null,null,null,null,null,null,null,null,null,null,null,null,null,null,null,null,null,null,null,null,null,null,null,null,null,null," ",null,null,{"$f":"COUNTIF(C72, {\"*-*\"})-COUNTIF(C72, {\"-*\"})","v":0},{"$f":"COUNTIF(C72, {\"*_*\"})","v":0}]
[null,null,null,null,null,null,null,null,null,null,null,null,null,null,null,null,null,null,null,null,null,null,null,null,null,null,null,null,null,null,null,null,null,null,null," ",null,null,{"$f":"COUNTIF(C73, {\"*-*\"})-COUNTIF(C73, {\"-*\"})","v":0},{"$f":"COUNTIF(C73, {\"*_*\"})","v":0}]
[null,null,null,null,null,null,null,null,null,null,null,null,null,null,null,null,null,null,null,null,null,null,null,null,null,null,null,null,null,null,null,null,null,null,null," ",null,null,{"$f":"COUNTIF(C74, {\"*-*\"})-COUNTIF(C74, {\"-*\"})","v":0},{"$f":"COUNTIF(C74, {\"*_*\"})","v":0}]
[null,null,null,null,null,null,null,null,null,null,null,null,null,null,null,null,null,null,null,null,null,null,null,null,null,null,null,null,null,null,null,null,null,null,null," ",null,null,{"$f":"COUNTIF(C75, {\"*-*\"})-COUNTIF(C75, {\"-*\"})","v":0},{"$f":"COUNTIF(C75, {\"*_*\"})","v":0}]
[null,null,null,null,null,null,null,null,null,null,null,null,null,null,null,null,null,null,null,null,null,null,null,null,null,null,null,null,null,null,null,null,null,null,null," ",null,null,{"$f":"COUNTIF(C76, {\"*-*\"})-COUNTIF(C76, {\"-*\"})","v":0},{"$f":"COUNTIF(C76, {\"*_*\"})","v":0}]
[null,null,null,null,null,null,null,null,null,null,null,null,null,null,null,null,null,null,null,null,null,null,null,null,null,null,null,null,null,null,null,null,null,null,null," ",null,null,{"$f":"COUNTIF(C77, {\"*-*\"})-COUNTIF(C77, {\"-*\"})","v":0},{"$f":"COUNTIF(C77, {\"*_*\"})","v":0}]
[null,null,null,null,null,null,null,null,null,null,null,null,null,null,null,null,null,null,null,null,null,null,null,null,null,null,null,null,null,null,null,null,null,null,null," ",null,null,{"$f":"COUNTIF(C78, {\"*-*\"})-COUNTIF(C78, {\"-*\"})","v":0},{"$f":"COUNTIF(C78, {\"*_*\"})","v":0}]
[null,null,null,null,null,null,null,null,null,null,null,null,null,null,null,null,null,null,null,null,null,null,null,null,null,null,null,null,null,null,null,null,null,null,null," ",null,null,{"$f":"COUNTIF(C79, {\"*-*\"})-COUNTIF(C79, {\"-*\"})","v":0},{"$f":"COUNTIF(C79, {\"*_*\"})","v":0}]
[null,null,null,null,null,null,null,null,null,null,null,null,null,null,null,null,null,null,null,null,null,null,null,null,null,null,null,null,null,null,null,null,null,null,null," ",null,null,{"$f":"COUNTIF(C80, {\"*-*\"})-COUNTIF(C80, {\"-*\"})","v":0},{"$f":"COUNTIF(C80, {\"*_*\"})","v":0}]
[null,null,null,null,null,null,null,null,null,null,null,null,null,null,null,null,null,null,null,null,null,null,null,null,null,null,null,null,null,null,null,null,null,null,null,null,null,null,{"$f":"COUNTIF(C81, {\"*-*\"})-COUNTIF(C81, {\"-*\"})","v":0},{"$f":"COUNTIF(C81, {\"*_*\"})","v":0}]
[null,null,null,null,null,null,null,null,null,null,null,null,null,null,null,null,null,null,null,null,null,null,null,null,null,null,null,null,null,null,null,null,null,null,null,null,null,null,{"$f":"COUNTIF(C82, {\"*-*\"})-COUNTIF(C82, {\"-*\"})","v":0},{"$f":"COUNTIF(C82, {\"*_*\"})","v":0}]
[null,null,null,null,null,null,null,null,null,null,null,null,null,null,null,null,null,null,null,null,null,null,null,null,null,null,null,null,null,null,null,null,null,null,null,null,null,null,{"$f":"COUNTIF(C83, {\"*-*\"})-COUNTIF(C83, {\"-*\"})","v":0},{"$f":"COUNTIF(C83, {\"*_*\"})","v":0}]
[null,null,null,null,null,null,null,null,null,null,null,null,null,null,null,null,null,null,null,null,null,null,null,null,null,null,null,null,null,null,null,null,null,null,null," ",null,null,{"$f":"COUNTIF(C84, {\"*-*\"})-COUNTIF(C84, {\"-*\"})","v":0},{"$f":"COUNTIF(C84, {\"*_*\"})","v":0}]
[null,null,null,null,null,null,null,null,null,null,null,null,null,null,null,null,null,null,null,null,null,null,null,null,null,null,null,null,null,null,null,null,null,null,null," ",null,null,{"$f":"COUNTIF(C85, {\"*-*\"})-COUNTIF(C85, {\"-*\"})","v":0},{"$f":"COUNTIF(C85, {\"*_*\"})","v":0}]
[null,null,null,null,null,null,null,null,null,null,null,null,null,null,null,null,null,null,null,null,null,null,null,null,null,null,null,null,null,null,null,null,null,null,null,null,null,null,{"$f":"COUNTIF(C86, {\"*-*\"})-COUNTIF(C86, {\"-*\"})","v":0},{"$f":"COUNTIF(C86, {\"*_*\"})","v":0}]
[null,null,null,null,null,null,null,null,null,null,null,null,null,null,null,null,null,null,null,null,null,null,null,null,null,null,null,null,null,null,null,null,null,null,null,null,null,null,{"$f":"COUNTIF(C87, {\"*-*\"})-COUNTIF(C87, {\"-*\"})","v":0},{"$f":"COUNTIF(C87, {\"*_*\"})","v":0}]
[null,null,null,null,null,null,null,null,null,null,null,null,null,null,null,null,null,null,null,null,null,null,null,null,null,null,null,null,null,null,null,null,null,null,null,null,null,null,{"$f":"COUNTIF(C88, {\"*-*\"})-COUNTIF(C88, {\"-*\"})","v":0},{"$f":"COUNTIF(C88, {\"*_*\"})","v":0}]
[null,null,null,null,null,null,null,null,null,null,null,null,null,null,null,null,null,null,null,null,null,null,null,null,null,null,null,null,null,null,null,null,null,null,null,null,null,null,{"$f":"COUNTIF(C89, {\"*-*\"})-COUNTIF(C89, {\"-*\"})","v":0},{"$f":"COUNTIF(C89, {\"*_*\"})","v":0}]
[null,null,null,null,null,null,null,null,null,null,null,null,null,null,null,null,null,null,null,null,null,null,null,null,null,null,null,null,null,null,null,null,null,null,null,null,null,null,{"$f":"COUNTIF(C90, {\"*-*\"})-COUNTIF(C90, {\"-*\"})","v":0},{"$f":"COUNTIF(C90, {\"*_*\"})","v":0}]
[null,null,null,null,null,null,null,null,null,null,null,null,null,null,null,null,null,null,null,null,null,null,null,null,null,null,null,null,null,null,null,null,null,null,null,null,null,null,{"$f":"COUNTIF(C91, {\"*-*\"})-COUNTIF(C91, {\"-*\"})","v":0},{"$f":"COUNTIF(C91, {\"*_*\"})","v":0}]
[null,null,null,null,null,null,null,null,null,null,null,null,null,null,null,null,null,null,null,null,null,null,null,null,null,null,null,null,null,null,null,null,null,null,null,null,null,null,{"$f":"COUNTIF(C92, {\"*-*\"})-COUNTIF(C92, {\"-*\"})","v":0},{"$f":"COUNTIF(C92, {\"*_*\"})","v":0}]
[null,null,null,null,null,null,null,null,null,null,null,null,null,null,null,null,null,null,null,null,null,null,null,null,null,null,null,null,null,null,null,null,null,null,null," ",null,null,{"$f":"COUNTIF(C93, {\"*-*\"})-COUNTIF(C93, {\"-*\"})","v":0},{"$f":"COUNTIF(C93, {\"*_*\"})","v":0}]
[null,null,null,null,null,null,null,null,null,null,null,null,null,null,null,null,null,null,null,null,null,null,null,null,null,null,null,null,null,null,null,null,null,null,null," ",null,null,{"$f":"COUNTIF(C94, {\"*-*\"})-COUNTIF(C94, {\"-*\"})","v":0},{"$f":"COUNTIF(C94, {\"*_*\"})","v":0}]
[null,null,null,null,null,null,null,null,null,null,null,null,null,null,null,null,null,null,null,null,null,null,null,null,null,null,null,null,null,null,null,null,null,null,null," ",null,null,{"$f":"COUNTIF(C95, {\"*-*\"})-COUNTIF(C95, {\"-*\"})","v":0},{"$f":"COUNTIF(C95, {\"*_*\"})","v":0}]
[null,null,null,null,null,null,null,null,null,null,null,null,null,null,null,null,null,null,null,null,null,null,null,null,null,null,null,null,null,null,null,null,null,null,null," ",null,null,{"$f":"COUNTIF(C96, {\"*-*\"})-COUNTIF(C96, {\"-*\"})","v":0},{"$f":"COUNTIF(C96, {\"*_*\"})","v":0}]
[null,null,null,null,null,null,null,null,null,null,null,null,null,null,null,null,null,null,null,null,null,null,null,null,null,null,null,null,null,null,null,null,null,null,null," ",null,null,{"$f":"COUNTIF(C97, {\"*-*\"})-COUNTIF(C97, {\"-*\"})","v":0},{"$f":"COUNTIF(C97, {\"*_*\"})","v":0}]
[null,null,null,null,null,null,null,null,null,null,null,null,null,null,null,null,null,null,null,null,null,null,null,null,null,null,null,null,null,null,null,null,null,null,null," ",null,null,{"$f":"COUNTIF(C98, {\"*-*\"})-COUNTIF(C98, {\"-*\"})","v":0},{"$f":"COUNTIF(C98, {\"*_*\"})","v":0}]
[null,null,null,null,null,null,null,null,null,null,null,null,null,null,null,null,null,null,null,null,null,null,null,null,null,null,null,null,null,null,null,null,null,null,null," ",null,null,{"$f":"COUNTIF(C99, {\"*-*\"})-COUNTIF(C99, {\"-*\"})","v":0},{"$f":"COUNTIF(C99, {\"*_*\"})","v":0}]
[null,null,null,null,null,null,null,null,null,null,null,null,null,null,null,null,null,null,null,null,null,null,null,null,null,null,null,null,null,null,null,null,null,null,null," ",null,null,{"$f":"COUNTIF(C100, {\"*-*\"})-COUNTIF(C100, {\"-*\"})","v":0},{"$f":"COUNTIF(C100, {\"*_*\"})","v":0}]
[null,null,null,null,null,null,null,null,null,null,null,null,null,null,null,null,null,null,null,null,null,null,null,null,null,null,null,null,null,null,null,null,null,null,null," ",null,null,{"$f":"COUNTIF(C101, {\"*-*\"})-COUNTIF(C101, {\"-*\"})","v":0},{"$f":"COUNTIF(C101, {\"*_*\"})","v":0}]
[null,null,null,null,null,null,null,null,null,null,null,null,null,null,null,null,null,null,null,null,null,null,null,null,null,null,null,null,null,null,null,null,null,null,null," ",null,null,{"$f":"COUNTIF(C102, {\"*-*\"})-COUNTIF(C102, {\"-*\"})","v":0},{"$f":"COUNTIF(C102, {\"*_*\"})","v":0}]
[null,null,null,null,null,null,null,null,null,null,null,null,null,null,null,null,null,null,null,null,null,null,null,null,null,null,null,null,null,null,null,null,null,null,null," ",null,null,{"$f":"COUNTIF(C103, {\"*-*\"})-COUNTIF(C103, {\"-*\"})","v":0},{"$f":"COUNTIF(C103, {\"*_*\"})","v":0}]
[null,null,null,null,null,null,null,null,null,null,null,null,null,null,null,null,null,null,null,null,null,null,null,null,null,null,null,null,null,null,null,null,null,null,null," ",null,null,{"$f":"COUNTIF(C104, {\"*-*\"})-COUNTIF(C104, {\"-*\"})","v":0},{"$f":"COUNTIF(C104, {\"*_*\"})","v":0}]
[null,null,null,null,null,null,null,null,null,null,null,null,null,null,null,null,null,null,null,null,null,null,null,null,null,null,null,null,null,null,null,null,null,null,null," ",null,null,{"$f":"COUNTIF(C105, {\"*-*\"})-COUNTIF(C105, {\"-*\"})","v":0},{"$f":"COUNTIF(C105, {\"*_*\"})","v":0}]
[null,null,null,null,null,null,null,null,null,null,null,null,null,null,null,null,null,null,null,null,null,null,null,null,null,null,null,null,null,null,null,null,null,null,null," ",null,null,{"$f":"COUNTIF(C106, {\"*-*\"})-COUNTIF(C106, {\"-*\"})","v":0},{"$f":"COUNTIF(C106, {\"*_*\"})","v":0}]
[null,null,null,null,null,null,null,null,null,null,null,null,null,null,null,null,null,null,null,null,null,null,null,null,null,null,null,null,null,null,null,null,null,null,null," ",null,null,{"$f":"COUNTIF(C107, {\"*-*\"})-COUNTIF(C107, {\"-*\"})","v":0},{"$f":"COUNTIF(C107, {\"*_*\"})","v":0}]
[null,null,null,null,null,null,null,null,null,null,null,null,null,null,null,null,null,null,null,null,null,null,null,null,null,null,null,null,null,null,null,null,null,null,null," ",null,null,{"$f":"COUNTIF(C108, {\"*-*\"})-COUNTIF(C108, {\"-*\"})","v":0},{"$f":"COUNTIF(C108, {\"*_*\"})","v":0}]
[null,null,null,null,null,null,null,null,null,null,null,null,null,null,null,null,null,null,null,null,null,null,null,null,null,null,null,null,null,null,null,null,null,null,null," ",null,null,{"$f":"COUNTIF(C109, {\"*-*\"})-COUNTIF(C109, {\"-*\"})","v":0},{"$f":"COUNTIF(C109, {\"*_*\"})","v":0}]
[null,null,null,null,null,null,null,null,null,null,null,null,null,null,null,null,null,null,null,null,null,null,null,null,null,null,null,null,null,null,null,null,null,null,null," ",null,null,{"$f":"COUNTIF(C110, {\"*-*\"})-COUNTIF(C110, {\"-*\"})","v":0},{"$f":"COUNTIF(C110, {\"*_*\"})","v":0}]
[null,null,null,null,null,null,null,null,null,null,null,null,null,null,null,null,null,null,null,null,null,null,null,null,null,null,null,null,null,null,null,null,null,null,null," ",null,null,{"$f":"COUNTIF(C111, {\"*-*\"})-COUNTIF(C111, {\"-*\"})","v":0},{"$f":"COUNTIF(C111, {\"*_*\"})","v":0}]
[null,null,null,null,null,null,null,null,null,null,null,null,null,null,null,null,null,null,null,null,null,null,null,null,null,null,null,null,null,null,null,null,null,null,null," ",null,null,{"$f":"COUNTIF(C112, {\"*-*\"})-COUNTIF(C112, {\"-*\"})","v":0},{"$f":"COUNTIF(C112, {\"*_*\"})","v":0}]
[null,null,null,null,null,null,null,null,null,null,null,null,null,null,null,null,null,null,null,null,null,null,null,null,null,null,null,null,null,null,null,null,null,null,null," ",null,null,{"$f":"COUNTIF(C113, {\"*-*\"})-COUNTIF(C113, {\"-*\"})","v":0},{"$f":"COUNTIF(C113, {\"*_*\"})","v":0}]
[null,null,null,null,null,null,null,null,null,null,null,null,null,null,null,null,null,null,null,null,null,null,null,null,null,null,null,null,null,null,null,null,null,null,null," ",null,null,{"$f":"COUNTIF(C114, {\"*-*\"})-COUNTIF(C114, {\"-*\"})","v":0},{"$f":"COUNTIF(C114, {\"*_*\"})","v":0}]
[null,null,null,null,null,null,null,null,null,null,null,null,null,null,null,null,null,null,null,null,null,null,null,null,null,null,null,null,null,null,null,null,null,null,null,null,null,null,{"$f":"COUNTIF(C115, {\"*-*\"})-COUNTIF(C115, {\"-*\"})","v":0},{"$f":"COUNTIF(C115, {\"*_*\"})","v":0}]
[null,null,null,null,null,null,null,null,null,null,null,null,null,null,null,null,null,null,null,null,null,null,null,null,null,null,null,null,null,null,null,null,null,null,null,null,null,null,{"$f":"COUNTIF(C116, {\"*-*\"})-COUNTIF(C116, {\"-*\"})","v":0},{"$f":"COUNTIF(C116, {\"*_*\"})","v":0}]
[null,null,null,null,null,null,null,null,null,null,null,null,null,null,null,null,null,null,null,null,null,null,null,null,null,null,null,null,null,null,null,null,null,null,null,null,null,null,{"$f":"COUNTIF(C117, {\"*-*\"})-COUNTIF(C117, {\"-*\"})","v":0},{"$f":"COUNTIF(C117, {\"*_*\"})","v":0}]
[null,null,null,null,null,null,null,null,null,null,null,null,null,null,null,null,null,null,null,null,null,null,null,null,null,null,null,null,null,null,null,null,null,null,null,null,null,null,{"$f":"COUNTIF(C118, {\"*-*\"})-COUNTIF(C118, {\"-*\"})","v":0},{"$f":"COUNTIF(C118, {\"*_*\"})","v":0}]
[null,null,null,null,null,null,null,null,null,null,null,null,null,null,null,null,null,null,null,null,null,null,null,null,null,null,null,null,null,null,null,null,null,null,null,null,null,null,{"$f":"COUNTIF(C119, {\"*-*\"})-COUNTIF(C119, {\"-*\"})","v":0},{"$f":"COUNTIF(C119, {\"*_*\"})","v":0}]
[null,null,null,null,null,null,null,null,null,null,null,null,null,null,null,null,null,null,null,null,null,null,null,null,null,null,null,null,null,null,null,null,null,null,null,null,null,null,{"$f":"COUNTIF(C120, {\"*-*\"})-COUNTIF(C120, {\"-*\"})","v":0},{"$f":"COUNTIF(C120, {\"*_*\"})","v":0}]
[null,null,null,null,null,null,null,null,null,null,null,null,null,null,null,null,null,null,null,null,null,null,null,null,null,null,null,null,null,null,null,null,null,null,null,null,null,null,{"$f":"COUNTIF(C121, {\"*-*\"})-COUNTIF(C121, {\"-*\"})","v":0},{"$f":"COUNTIF(C121, {\"*_*\"})","v":0}]
[null,null,null,null,null,null,null,null,null,null,null,null,null,null,null,null,null,null,null,null,null,null,null,null,null,null,null,null,null,null,null,null,null,null,null," ",null,null,{"$f":"COUNTIF(C122, {\"*-*\"})-COUNTIF(C122, {\"-*\"})","v":0},{"$f":"COUNTIF(C122, {\"*_*\"})","v":0}]
[null,null,null,null,null,null,null,null,null,null,null,null,null,null,null,null,null,null,null,null,null,null,null,null,null,null,null,null,null,null,null,null,null,null,null," ",null,null,{"$f":"COUNTIF(C123, {\"*-*\"})-COUNTIF(C123, {\"-*\"})","v":0},{"$f":"COUNTIF(C123, {\"*_*\"})","v":0}]
[null,null,null,null,null,null,null,null,null,null,null,null,null,null,null,null,null,null,null,null,null,null,null,null,null,null,null,null,null,null,null,null,null,null,null," ",null,null,{"$f":"COUNTIF(C124, {\"*-*\"})-COUNTIF(C124, {\"-*\"})","v":0},{"$f":"COUNTIF(C124, {\"*_*\"})","v":0}]
[null,null,null,null,null,null,null,null,null,null,null,null,null,null,null,null,null,null,null,null,null,null,null,null,null,null,null,null,null,null,null,null,null,null,null," ",null,null,{"$f":"COUNTIF(C125, {\"*-*\"})-COUNTIF(C125, {\"-*\"})","v":0},{"$f":"COUNTIF(C125, {\"*_*\"})","v":0}]
[null,null,null,null,null,null,null,null,null,null,null,null,null,null,null,null,null,null,null,null,null,null,null,null,null,null,null,null,null,null,null,null,null,null,null," ",null,null,{"$f":"COUNTIF(C126, {\"*-*\"})-COUNTIF(C126, {\"-*\"})","v":0},{"$f":"COUNTIF(C126, {\"*_*\"})","v":0}]
[null,null,null,null,null,null,null,null,null,null,null,null,null,null,null,null,null,null,null,null,null,null,null,null,null,null,null,null,null,null,null,null,null,null,null," ",null,null,{"$f":"COUNTIF(C127, {\"*-*\"})-COUNTIF(C127, {\"-*\"})","v":0},{"$f":"COUNTIF(C127, {\"*_*\"})","v":0}]
[null,null,null,null,null,null,null,null,null,null,null,null,null,null,null,null,null,null,null,null,null,null,null,null,null,null,null,null,null,null,null,null,null,null,null," ",null,null,{"$f":"COUNTIF(C128, {\"*-*\"})-COUNTIF(C128, {\"-*\"})","v":0},{"$f":"COUNTIF(C128, {\"*_*\"})","v":0}]
[null,null,null,null,null,null,null,null,null,null,null,null,null,null,null,null,null,null,null,null,null,null,null,null,null,null,null,null,null,null,null,null,null,null,null," ",null,null,{"$f":"COUNTIF(C129, {\"*-*\"})-COUNTIF(C129, {\"-*\"})","v":0},{"$f":"COUNTIF(C129, {\"*_*\"})","v":0}]
[null,null,null,null,null,null,null,null,null,null,null,null,null,null,null,null,null,null,null,null,null,null,null,null,null,null,null,null,null,null,null,null,null,null,null," ",null,null,{"$f":"COUNTIF(C130, {\"*-*\"})-COUNTIF(C130, {\"-*\"})","v":0},{"$f":"COUNTIF(C130, {\"*_*\"})","v":0}]
[null,null,null,null,null,null,null,null,null,null,null,null,null,null,null,null,null,null,null,null,null,null,null,null,null,null,null,null,null,null,null,null,null,null,null," ",null,null,{"$f":"COUNTIF(C131, {\"*-*\"})-COUNTIF(C131, {\"-*\"})","v":0},{"$f":"COUNTIF(C131, {\"*_*\"})","v":0}]
[null,null,null,null,null,null,null,null,null,null,null,null,null,null,null,null,null,null,null,null,null,null,null,null,null,null,null,null,null,null,null,null,null,null,null," ",null,null,{"$f":"COUNTIF(C132, {\"*-*\"})-COUNTIF(C132, {\"-*\"})","v":0},{"$f":"COUNTIF(C132, {\"*_*\"})","v":0}]
[null,null,null,null,null,null,null,null,null,null,null,null,null,null,null,null,null,null,null,null,null,null,null,null,null,null,null,null,null,null,null,null,null,null,null," ",null,null,{"$f":"COUNTIF(C133, {\"*-*\"})-COUNTIF(C133, {\"-*\"})","v":0},{"$f":"COUNTIF(C133, {\"*_*\"})","v":0}]
[null,null,null,null,null,null,null,null,null,null,null,null,null,null,null,null,null,null,null,null,null,null,null,null,null,null,null,null,null,null,null,null,null,null,null," ",null,null,{"$f":"COUNTIF(C134, {\"*-*\"})-COUNTIF(C134, {\"-*\"})","v":0},{"$f":"COUNTIF(C134, {\"*_*\"})","v":0}]
[null,null,null,null,null,null,null,null,null,null,null,null,null,null,null,null,null,null,null,null,null,null,null,null,null,null,null,null,null,null,null,null,null,null,null," ",null,null,{"$f":"COUNTIF(C135, {\"*-*\"})-COUNTIF(C135, {\"-*\"})","v":0},{"$f":"COUNTIF(C135, {\"*_*\"})","v":0}]
[null,null,null,null,null,null,null,null,null,null,null,null,null,null,null,null,null,null,null,null,null,null,null,null,null,null,null,null,null,null,null,null,null,null,null," ",null,null,{"$f":"COUNTIF(C136, {\"*-*\"})-COUNTIF(C136, {\"-*\"})","v":0},{"$f":"COUNTIF(C136, {\"*_*\"})","v":0}]
[null,null,null,null,null,null,null,null,null,null,null,null,null,null,null,null,null,null,null,null,null,null,null,null,null,null,null,null,null,null,null,null,null,null,null," ",null,null,{"$f":"COUNTIF(C137, {\"*-*\"})-COUNTIF(C137, {\"-*\"})","v":0},{"$f":"COUNTIF(C137, {\"*_*\"})","v":0}]
[null,null,null,null,null,null,null,null,null,null,null,null,null,null,null,null,null,null,null,null,null,null,null,null,null,null,null,null,null,null,null,null,null,null,null," ",null,null,{"$f":"COUNTIF(C138, {\"*-*\"})-COUNTIF(C138, {\"-*\"})","v":0},{"$f":"COUNTIF(C138, {\"*_*\"})","v":0}]
[null,null,null,null,null,null,null,null,null,null,null,null,null,null,null,null,null,null,null,null,null,null,null,null,null,null,null,null,null,null,null,null,null,null,null," ",null,null,{"$f":"COUNTIF(C139, {\"*-*\"})-COUNTIF(C139, {\"-*\"})","v":0},{"$f":"COUNTIF(C139, {\"*_*\"})","v":0}]
[null,null,null,null,null,null,null,null,null,null,null,null,null,null,null,null,null,null,null,null,null,null,null,null,null,null,null,null,null,null,null,null,null,null,null," ",null,null,{"$f":"COUNTIF(C140, {\"*-*\"})-COUNTIF(C140, {\"-*\"})","v":0},{"$f":"COUNTIF(C140, {\"*_*\"})","v":0}]
[null,null,null,null,null,null,null,null,null,null,null,null,null,null,null,null,null,null,null,null,null,null,null,null,null,null,null,null,null,null,null,null,null,null,null," ",null,null,{"$f":"COUNTIF(C141, {\"*-*\"})-COUNTIF(C141, {\"-*\"})","v":0},{"$f":"COUNTIF(C141, {\"*_*\"})","v":0}]
[null,null,null,null,null,null,null,null,null,null,null,null,null,null,null,null,null,null,null,null,null,null,null,null,null,null,null,null,null,null,null,null,null,null,null," ",null,null,{"$f":"COUNTIF(C142, {\"*-*\"})-COUNTIF(C142, {\"-*\"})","v":0},{"$f":"COUNTIF(C142, {\"*_*\"})","v":0}]
[null,null,null,null,null,null,null,null,null,null,null,null,null,null,null,null,null,null,null,null,null,null,null,null,null,null,null,null,null,null,null,null,null,null,null," ",null,null,{"$f":"COUNTIF(C143, {\"*-*\"})-COUNTIF(C143, {\"-*\"})","v":0},{"$f":"COUNTIF(C143, {\"*_*\"})","v":0}]
["ALS afrapporterer max. 100 prøver pr. sag. Såfremt der fremsendes flere end 100 prøver samtidigt, udfyldes flere rekvisitioner."]
[]
[]
[]
[]
[]
[null,null,null,null,null,null,null,null,null,null,null,null,null,null,null,null,null,null,null,null,null,null,null,null,null,null,null,null,null,null,null,null,null,null,null," "]
[null,null,null,null,null,null,null,null,null,null,null,null,null,null,null,null,null,null,null,null,null,null,null,null,null,null,null,null,null,null,null,null,null,null,null," "]
[null,null,null,null,null,null,null,null,null,null,null,null,null,null,null,null,null,null,null,null,null,null,null,null,null,null,null,null,null,null,null,null,null,null,null," "]
[null,null,null,null,null,null,null,null,null,null,null,null,null,null,null,null,null,null,null,null,null,null,null,null,null,null,null,null,null,null,null,null,null,null,null," "]
[null,null,null,null,null,null,null,null,null,null,null,null,null,null,null,null,null,null,null,null,null,null,null,null,null,null,null,null,null,null,null,null,null,null,null," "]
[null,null,null,null,null,null,null,null,null,null,null,null,null,null,null,null,null,null,null,null,null,null,null,null,null,null,null,null,null,null,null,null,null,null,null," "]
[null,null,null,null,null,null,null,null,null,null,null,null,null,null,null,null,null,null,null,null,null,null,null,null,null,null,null,null,null,null,null,null,null,null,null," "]
[null,null,null,null,null,null,null,null,null,null,null,null,null,null,null,null,null,null,null,null,null,null,null,null,null,null,null,null,null,null,null,null,null,null,null," "]
[null,null,null,null,null,null,null,null,null,null,null,null,null,null,null,null,null,null,null,null,null,null,null,null,null,null,null,null,null,null,null,null,null,null,null," "]
[null,null,null,null,null,null,null,null,null,null,null,null,null,null,null,null,null,null,null,null,null,null,null,null,null,null,null,null,null,null,null,null,null,null,null," "]
[null,null,null,null,null,null,null,null,null,null,null,null,null,null,null,null,null,null,null,null,null,null,null,null,null,null,null,null,null,null,null,null,null,null,null," "]
[null,null,null,null,null,null,null,null,null,null,null,null,null,null,null,null,null,null,null,null,null,null,null,null,null,null,null,null,null,null,null,null,null,null,null," "]
[null,null,null,null,null,null,null,null,null,null,null,null,null,null,null,null,null,null,null,null,null,null,null,null,null,null,null,null,null,null,null,null,null,null,null," "]
[null,null,null,null,null,null,null,null,null,null,null,null,null,null,null,null,null,null,null,null,null,null,null,null,null,null,null,null,null,null,null,null,null,null,null," "]
[null,null,null,null,null,null,null,null,null,null,null,null,null,null,null,null,null,null,null,null,null,null,null,null,null,null,null,null,null,null,null,null,null,null,null," "]
[null,null,null,null,null,null,null,null,null,null,null,null,null,null,null,null,null,null,null,null,null,null,null,null,null,null,null,null,null,null,null,null,null,null,null," "]
[null,null,null,null,null,null,null,null,null,null,null,null,null,null,null,null,null,null,null,null,null,null,null,null,null,null,null,null,null,null,null,null,null,null,null," "]
[null,null,null,null,null,null,null,null,null,null,null,null,null,null,null,null,null,null,null,null,null,null,null,null,null,null,null,null,null,null,null,null,null,null,null," "]
[null,null,null,null,null,null,null,null,null,null,null,null,null,null,null,null,null,null,null,null,null,null,null,null,null,null,null,null,null,null,null,null,null,null,null," "]
[null,null,null,null,null,null,null,null,null,null,null,null,null,null,null,null,null,null,null,null,null,null,null,null,null,null,null,null,null,null,null,null,null,null,null," "]
[null,null,null,null,null,null,null,null,null,null,null,null,null,null,null,null,null,null,null,null,null,null,null,null,null,null,null,null,null,null,null,null,null,null,null," "]
[null,null,null,null,null,null,null,null,null,null,null,null,null,null,null,null,null,null,null,null,null,null,null,null,null,null,null,null,null,null,null,null,null,null,null," "]
[]
[null,null,null,null,null,null,null,null,null,null,null,null,null,null,null,null,null,null,null,null,null,null,null,null,null,"Fortsættes (sæt kryds) "]

{"sheet":"3. Vand","index":2,"n_rows":42,"n_cols":28,"rows_kept":42,"cut":false,"hidden":false,"merged":[[9,5,9,12],[4,21,4,25],[4,5,4,17],[101,0,101,2],[101,8,101,9],[101,10,101,11],[1,0,2,27],[98,0,98,2],[98,8,98,9],[98,10,98,11],[99,0,99,2],[99,8,99,9],[99,10,99,11],[100,0,100,2],[100,8,100,9],[100,10,100,11],[95,0,95,2],[95,8,95,9],[95,10,95,11],[96,0,96,2],[10,5,10,12],[11,5,11,12],[29,22,41,22],[96,8,96,9],[96,10,96,11],[97,0,97,2],[97,8,97,9],[97,10,97,11],[22,16,22,24],[93,0,93,2],[93,8,93,9],[93,10,93,11],[94,0,94,2],[94,8,94,9],[94,10,94,11],[44,0,44,2],[43,0,43,2],[45,0,45,2],[44,10,44,11],[45,10,45,11],[29,18,41,18],[29,21,41,21],[25,0,27,27],[28,0,28,11],[29,23,29,27],[30,23,41,23],[30,24,41,24],[30,25,41,25],[30,27,41,27],[30,26,41,26],[29,20,41,20],[29,12,41,12],[14,16,14,24],[15,16,15,24],[16,16,16,24],[17,16,17,24],[29,17,41,17],[29,16,41,16],[29,13,41,13],[29,14,41,14],[21,16,21,24],[19,6,19,13],[29,19,41,19],[29,15,41,15],[18,16,18,24],[42,8,42,9],[43,8,43,9],[44,8,44,9],[45,8,45,9],[46,8,46,9],[29,8,41,9],[42,10,42,11],[43,10,43,11],[29,7,41,7],[41,10,41,11],[29,10,40,11],[50,0,50,2],[51,0,51,2],[6,22,6,24],[7,21,7,23],[3,15,3,25],[3,3,3,9],[58,10,58,11],[59,10,59,11],[56,8,56,9],[57,8,57,9],[50,10,50,11],[51,10,51,11],[50,8,50,9],[51,8,51,9],[15,6,15,13],[16,6,16,13],[17,6,17,13],[6,5,7,12],[19,16,19,24],[20,16,20,24],[14,6,14,13],[18,6,18,13],[52,8,52,9],[46,10,46,11],[71,3,71,6],[72,3,72,6],[60,10,60,11],[61,10,61,11],[61,8,61,9],[24,0,24,27],[42,0,42,2],[46,0,46,2],[58,8,58,9],[59,8,59,9],[60,8,60,9],[52,10,52,11],[53,10,53,11],[54,10,54,11],[55,10,55,11],[56,10,56,11],[57,10,57,11],[48,8,48,9],[49,8,49,9],[49,10,49,11],[47,10,47,11],[48,10,48,11],[48,0,48,2],[47,8,47,9],[56,0,56,2],[57,0,57,2],[53,8,53,9],[54,8,54,9],[55,8,55,9],[70,0,70,2],[66,0,66,2],[58,0,58,2],[55,0,55,2],[65,0,65,2],[67,0,67,2],[62,0,62,2],[63,0,63,2],[68,0,68,2],[69,0,69,2],[67,3,67,6],[68,3,68,6],[69,3,69,6],[70,3,70,6],[52,0,52,2],[64,0,64,2],[50,3,50,6],[51,3,51,6],[62,3,62,6],[63,3,63,6],[64,3,64,6],[65,3,65,6],[66,3,66,6],[61,0,61,2],[60,0,60,2],[59,0,59,2],[53,0,53,2],[54,0,54,2],[52,3,52,6],[53,3,53,6],[54,3,54,6],[55,3,55,6],[56,3,56,6],[57,3,57,6],[58,3,58,6],[59,3,59,6],[60,3,60,6],[61,3,61,6],[62,10,62,11],[63,10,63,11],[64,10,64,11],[71,8,71,9],[66,8,66,9],[67,8,67,9],[68,8,68,9],[69,8,69,9],[70,8,70,9],[69,10,69,11],[62,8,62,9],[63,8,63,9],[64,8,64,9],[65,8,65,9],[67,10,67,11],[68,10,68,11],[66,10,66,11],[65,10,65,11],[70,10,70,11],[73,8,73,9],[73,10,73,11],[76,3,76,6],[75,0,75,2],[75,8,75,9],[75,10,75,11],[76,0,76,2],[72,8,72,9],[78,0,78,2],[78,8,78,9],[78,10,78,11],[76,8,76,9],[72,0,72,2],[91,0,91,2],[91,8,91,9],[91,10,91,11],[92,0,92,2],[92,8,92,9],[92,10,92,11],[81,0,81,2],[81,8,81,9],[81,10,81,11],[82,0,82,2],[84,0,84,2],[84,8,84,9],[84,10,84,11],[82,8,82,9],[82,10,82,11],[83,0,83,2],[83,8,83,9],[83,10,83,11],[86,0,86,2],[86,8,86,9],[90,0,90,2],[87,0,87,2],[87,8,87,9],[87,10,87,11],[88,0,88,2],[88,8,88,9],[88,10,88,11],[90,8,90,9],[90,10,90,11],[29,0,40,6],[41,0,41,2],[41,3,41,6],[86,10,86,11],[85,0,85,2],[85,8,85,9],[85,10,85,11],[89,0,89,2],[89,8,89,9],[89,10,89,11],[76,10,76,11],[77,0,77,2],[77,8,77,9],[77,10,77,11],[80,0,80,2],[80,8,80,9],[80,10,80,11],[79,0,79,2],[79,8,79,9],[79,10,79,11],[71,10,71,11],[71,0,71,2],[74,0,74,2],[74,8,74,9],[42,3,42,6],[43,3,43,6],[44,3,44,6],[45,3,45,6],[46,3,46,6],[47,3,47,6],[48,3,48,6],[49,3,49,6],[47,0,47,2],[49,0,49,2],[73,3,73,6],[74,3,74,6],[75,3,75,6],[77,3,77,6],[78,3,78,6],[79,3,79,6],[74,10,74,11],[72,10,72,11],[73,0,73,2],[80,3,80,6],[81,3,81,6],[82,3,82,6],[83,3,83,6],[84,3,84,6],[85,3,85,6],[95,3,95,6],[96,3,96,6],[97,3,97,6],[98,3,98,6],[99,3,99,6],[100,3,100,6],[101,3,101,6],[86,3,86,6],[87,3,87,6],[88,3,88,6],[89,3,89,6],[90,3,90,6],[91,3,91,6],[92,3,92,6],[93,3,93,6],[94,3,94,6]]}
[]
["Analyserekvisition VAND"]
[]
["Sagsnr.:",null,null,{"$f":"IF('1. Stamdata'!D22=\"\",\"\",'1. Stamdata'!D22)","v":""},null,null,null,null,null,null,null,"Lokalitetsnr.:",null,null,null,{"$f":"IF('1. Stamdata'!N22=\"\",\"\",'1. Stamdata'!N22)","v":""}]
["Lokalitetsnavn:",null,null,null,null,{"$f":"IF('1. Stamdata'!D23=\"\",\"\",'1. Stamdata'!D23)","v":""},null,null,null,null,null,null,null,null,null,null,null,null,null,"Region:",null,{"$f":"IF('1. Stamdata'!Q23=\"\",\"\",'1. Stamdata'!Q23)","v":""}]
[]
[]
["Prøvetager:",null,null,null,null,null,null,null,null,null,null,null,null,null,null,null,"Leveringstid:"]
[null,null,null,null,null,null,null,null,null,null,null,null,null,null,null,null,"Normal:"]
["Udtagningsdato:",null,null,null,null,null,null,null,null,null,null,null,null,null,null,null,"Dag-til-dag"]
["Indleveringsdato:",null,null,null,null,null,null,null,null,null,null,null,null,null,null,null,"Dag-til-dag (P12):"]
["Rekvisitionsdato:",null,null,null,null,null,null,null,null,null,null,null,null,null,null,null,"Dag-til-dag (P9):"]
[]
[null,null,null,null,null,null,"Rapportmodtager:",null,null,null,null,null,null,null,null,null,"Fakturamodtager:"]
[{"$f":"'1. Stamdata'!$B$26","v":"Firma:"},null,null,null,null,null,{"$f":"IF('1. Stamdata'!D26=\"\",\"\",'1. Stamdata'!D26)","v":""},null,null,null,null,null,null,null,null,null,{"$f":"IF('1. Stamdata'!M26=\"\",\"\",'1. Stamdata'!M26)","v":""}]
[{"$f":"'1. Stamdata'!$B$27","v":"Adresse:"},null,null,null,null,null,{"$f":"IF('1. Stamdata'!D27=\"\",\"\",'1. Stamdata'!D27)","v":""},null,null,null,null,null,null,null,null,null,{"$f":"IF('1. Stamdata'!M27=\"\",\"\",'1. Stamdata'!M27)","v":""}]
[{"$f":"'1. Stamdata'!$B$28","v":"Postnr./By:"},null,null,null,null,null,{"$f":"IF('1. Stamdata'!D28=\"\",\"\",'1. Stamdata'!D28)","v":""},null,null,null,null,null,null,null,null,null,{"$f":"IF('1. Stamdata'!M28=\"\",\"\",'1. Stamdata'!M28)","v":""}]
[{"$f":"'1. Stamdata'!$B$29","v":"Kontaktperson:"},null,null,null,null,null,{"$f":"IF('1. Stamdata'!D29=\"\",\"\",'1. Stamdata'!D29)","v":""},null,null,null,null,null,null,null,null,null,{"$f":"IF('1. Stamdata'!M29=\"\",\"\",'1. Stamdata'!M29)","v":""}]
[{"$f":"'1. Stamdata'!$B$30","v":"Telefonnummer:"},null,null,null,null,null,{"$f":"IF('1. Stamdata'!D30=\"\",\"\",'1. Stamdata'!D30)","v":""},null,null,null,null,null,null,null,null,null,{"$f":"IF('1. Stamdata'!M30=\"\",\"\",'1. Stamdata'!M30)","v":""}]
[{"$f":"'1. Stamdata'!$B31","v":"E-mail | EAN:"},null,null,null,null,null,{"$f":"IF('1. Stamdata'!D31=\"\",\"\",'1. Stamdata'!D31)","v":""},null,null,null,null,null,null,null,null,null,{"$f":"IF('1. Stamdata'!M31=\"\",\"\",'1. Stamdata'!M31)","v":""}]
[{"$f":"'1. Stamdata'!$B32","v":"Personreference:"},null,null,null,null,null,null,null,null,null,null,null,null,null,null,null,{"$f":"IF('1. Stamdata'!M32=\"\",\"\",'1. Stamdata'!M32)","v":""}]
[{"$f":"'1. Stamdata'!$B33","v":"Fakturareference:"},null,null,null,null,null,null,null,null,null,null,null,null,null,null,null,{"$f":"IF('1. Stamdata'!M33=\"\",\"\",'1. Stamdata'!M33)","v":""}]
[{"$f":"'1. Stamdata'!$B34","v":"Fakturering:"},null,null,null,null,null,null,null,null,null,null,null,null,null,null,null,{"$f":"IF('1. Stamdata'!M34=\"\",\"\",'1. Stamdata'!M34)","v":"Månedlig samlefaktura (A)"}]
[]
["Bemærkninger og beskrivelse af prøver (klarhed, bundfald, fri fase ect.):"]
[]
[]
[]
["Optælling",null,null,null,null,null,null,null,null,null,null,null,{"$f":"COUNTA(M43:M93)","v":0},{"$f":"COUNTA(N43:N93)","v":0},0,0,0,0,0,0,0,0,0,0,0,0,0,0]
["Rekvisition udfyldes med \nén prøve pr. linje",null,null,null,null,null,null,"Filternr.","Udtagningstidspunkt",null,"Forbeholdt ALS",null,"Kulbrinter og BTEXN (6675)","Chlorerede opløsningsmidler inkl. DCM (6676)","Chlorerede nedbrydningsprodukter (5844)","Chlor.opl. + nedbrydningsprod. Inkl. DCM (6678)","Kulbrinter+BTEXN+chlor.opl. (6702)","Kulbrinter + BTEXN + chlor.opl. + nedbr. (6703)","Polære opløsningsmidler HS (6496)","PAH'er 16 stoffer (5679)","Phenoler (5985)","Phenoler og chlorphenoler (5984)","PFAS, MST 12 stoffer (6507)","Andet"]
[]
[]
[]
[]
[]
[]
[]
[]
[]
[]
[]
["B.nr.",null,null,"DGU",null,null,null,null,null,null,"Labnr."]

{"sheet":"4. Vand inkl. feltmålinger","index":3,"n_rows":51,"n_cols":28,"rows_kept":51,"cut":false,"hidden":false,"merged":[[20,11,20,15],[21,11,21,15],[22,11,22,15],[30,19,30,23],[28,19,28,23],[21,16,21,24],[27,13,27,18],[22,16,22,24],[29,13,29,18],[26,19,26,23],[27,19,27,23],[28,13,28,18],[30,13,30,18],[4,21,4,25],[4,5,4,17],[10,5,10,12],[11,5,11,12],[6,5,7,12],[6,22,6,24],[7,21,7,23],[9,5,9,12],[15,16,15,24],[16,6,16,13],[16,16,16,24],[17,6,17,13],[17,16,17,24],[15,6,15,13],[31,6,31,10],[27,0,27,5],[28,0,28,5],[30,0,30,5],[30,6,30,10],[28,6,28,10],[27,6,27,10],[29,6,29,10],[29,0,29,5],[1,0,2,27],[38,10,49,11],[50,10,50,11],[14,6,14,13],[14,16,14,24],[3,3,3,9],[3,15,3,25],[18,6,18,13],[18,16,18,24],[19,6,19,13],[19,16,19,24],[20,16,20,24],[26,0,26,5],[26,6,26,10],[26,13,26,18],[29,19,29,23],[51,0,51,2],[51,8,51,9],[51,10,51,11],[38,17,50,17],[38,15,50,15],[38,16,50,16],[51,3,51,6],[38,7,50,7],[38,8,50,9],[38,12,50,12],[38,14,50,14],[38,13,50,13],[38,0,49,6],[50,3,50,6],[50,0,50,2],[33,17,33,27],[34,0,36,27],[33,0,33,16],[31,0,31,5],[39,27,50,27],[37,0,37,11],[38,18,50,18],[38,20,50,20],[38,21,50,21],[38,22,50,22],[38,19,50,19],[39,23,50,23],[38,23,38,27],[39,26,50,26],[39,24,50,24],[39,25,50,25]]}
[]
["Analyserekvisition VAND"]
[]
["Sagsnr.:",null,null,{"$f":"IF('1. Stamdata'!D22=\"\",\"\",'1. Stamdata'!D22)","v":""},null,null,null,null,null,null,null,"Lokalitetsnr.:",null,null,null,{"$f":"IF('1. Stamdata'!N22=\"\",\"\",'1. Stamdata'!N22)","v":""}]
["Lokalitetsnavn:",null,null,null,null,{"$f":"IF('1. Stamdata'!D23=\"\",\"\",'1. Stamdata'!D23)","v":""},null,null,null,null,null,null,null,null,null,null,null,null,null,"Region:",null,{"$f":"IF('1. Stamdata'!Q23=\"\",\"\",'1. Stamdata'!Q23)","v":""}]
[]
[]
["Prøvetager:",null,null,null,null,null,null,null,null,null,null,null,null,null,null,null,"Leveringstid:"]
[null,null,null,null,null,null,null,null,null,null,null,null,null,null,null,null,"Normal:"]
["Udtagningsdato:",null,null,null,null,null,null,null,null,null,null,null,null,null,null,null,"Dag-til-dag"]
["Indleveringsdato:",null,null,null,null,null,null,null,null,null,null,null,null,null,null,null,"Dag-til-dag (P12):"]
["Rekvisitionsdato:",null,null,null,null,null,null,null,null,null,null,null,null,null,null,null,"Dag-til-dag (P9):"]
[]
[null,null,null,null,null,null,"Rapportmodtager:",null,null,null,null,null,null,null,null,null,"Fakturamodtager:"]
[{"$f":"'1. Stamdata'!$B$26","v":"Firma:"},null,null,null,null,null,{"$f":"IF('1. Stamdata'!D26=\"\",\"\",'1. Stamdata'!D26)","v":""},null,null,null,null,null,null,null,null,null,{"$f":"IF('1. Stamdata'!M26=\"\",\"\",'1. Stamdata'!M26)","v":""}]
[{"$f":"'1. Stamdata'!$B$27","v":"Adresse:"},null,null,null,null,null,{"$f":"IF('1. Stamdata'!D27=\"\",\"\",'1. Stamdata'!D27)","v":""},null,null,null,null,null,null,null,null,null,{"$f":"IF('1. Stamdata'!M27=\"\",\"\",'1. Stamdata'!M27)","v":""}]
[{"$f":"'1. Stamdata'!$B$28","v":"Postnr./By:"},null,null,null,null,null,{"$f":"IF('1. Stamdata'!D28=\"\",\"\",'1. Stamdata'!D28)","v":""},null,null,null,null,null,null,null,null,null,{"$f":"IF('1. Stamdata'!M28=\"\",\"\",'1. Stamdata'!M28)","v":""}]
[{"$f":"'1. Stamdata'!$B$29","v":"Kontaktperson:"},null,null,null,null,null,{"$f":"IF('1. Stamdata'!D29=\"\",\"\",'1. Stamdata'!D29)","v":""},null,null,null,null,null,null,null,null,null,{"$f":"IF('1. Stamdata'!M29=\"\",\"\",'1. Stamdata'!M29)","v":""}]
[{"$f":"'1. Stamdata'!$B$30","v":"Telefonnummer:"},null,null,null,null,null,{"$f":"IF('1. Stamdata'!D30=\"\",\"\",'1. Stamdata'!D30)","v":""},null,null,null,null,null,null,null,null,null,{"$f":"IF('1. Stamdata'!M30=\"\",\"\",'1. Stamdata'!M30)","v":""}]
[{"$f":"'1. Stamdata'!$B31","v":"E-mail | EAN:"},null,null,null,null,null,{"$f":"IF('1. Stamdata'!D31=\"\",\"\",'1. Stamdata'!D31)","v":""},null,null,null,null,null,null,null,null,null,{"$f":"IF('1. Stamdata'!M31=\"\",\"\",'1. Stamdata'!M31)","v":""}]
[{"$f":"'1. Stamdata'!$B32","v":"Personreference:"},null,null,null,null,null,null,null,null,null,null,null,null,null,null,null,{"$f":"IF('1. Stamdata'!M32=\"\",\"\",'1. Stamdata'!M32)","v":""}]
[{"$f":"'1. Stamdata'!$B33","v":"Fakturareference:"},null,null,null,null,null,null,null,null,null,null,null,null,null,null,null,{"$f":"IF('1. Stamdata'!M33=\"\",\"\",'1. Stamdata'!M33)","v":""}]
[{"$f":"'1. Stamdata'!$B34","v":"Fakturering:"},null,null,null,null,null,null,null,null,null,null,null,null,null,null,null,{"$f":"IF('1. Stamdata'!M34=\"\",\"\",'1. Stamdata'!M34)","v":"Månedlig samlefaktura (A)"}]
[]
[]
["Feltmålinger"]
["Temperatur (°C):",null,null,null,null,null,null,null,null,null,null,null,null,"Forpumpning (l):"]
["pH:",null,null,null,null,null,null,null,null,null,null,null,null,"Pumpeydelse (m3/t):"]
["Ledningsevne (mS/m):",null,null,null,null,null,null,null,null,null,null,null,null,"Pejlings målepunkt:"]
["Iltindhold (mg/l):",null,null,null,null,null,null,null,null,null,null,null,null,"Pejling i ro (m u.mp.)"]
["Iltmætning (%):",null,null,null,null,null,null,null,null,null,null,null,null,"Pejling i drift (m u.mp.):"]
["Redoxpotentiale (mV):"]
[]
["Bemærkninger og beskrivelse af prøver (klarhed, bundfald, fri fase ect.):"]
[]
[]
[]
["Optælling",null,null,null,null,null,null,null,null,null,null,null,{"$f":"COUNTA(M52:M53)","v":0},0,0,0,0,0,0,0,0,0,0,0,0,0,0,0]
["Rekvisition udfyldes med \nén prøve pr. linje",null,null,null,null,null,null,"Filternr.","Udtagningstidspunkt",null,"Forbeholdt ALS",null,"Kulbrinter og BTEXN (6675)","Chlorerede opløsningsmidler inkl. DCM (6676)","Chlorerede nedbrydningsprodukter (5844)","Chlor.opl. + nedbrydningsprod. Inkl. DCM (6678)","Kulbrinter+BTEXN+chlor.opl. (6702)","Kulbrinter + BTEXN + chlor.opl. + nedbr. (6703)","Hovedbestanddele (6682)","Hovedbestanddele inkl. As, Ba, B (6683)","Redox pakke (6684)","Redox pakke stor (6685)","PFAS, MST 12 stoffer (6507)","Andet"]
[]
[]
[]
[]
[]
[]
[]
[]
[]
[]
[]
["B.nr.",null,null,"DGU",null,null,null,null,null,null,"Labnr."]

{"sheet":"5. Luft-Kulrør","index":4,"n_rows":145,"n_cols":39,"rows_kept":145,"cut":false,"hidden":false,"merged":[[20,5,20,9],[21,5,21,9],[22,5,22,9],[32,35,43,35],[32,36,43,36],[32,37,43,37],[32,38,43,38],[4,11,4,13],[4,2,4,10],[30,6,30,11],[30,12,30,14],[32,23,43,23],[32,24,43,24],[32,33,43,33],[32,34,43,34],[9,2,9,6],[22,10,22,18],[31,10,43,10],[25,0,28,19],[29,0,29,5],[29,15,29,19],[30,15,30,19],[43,1,43,2],[30,0,42,2],[31,12,43,12],[31,18,43,18],[31,13,43,13],[31,17,43,17],[31,19,43,19],[31,7,43,7],[31,9,43,9],[31,6,43,6],[31,8,43,8],[1,0,2,19],[19,10,19,18],[20,10,20,18],[24,0,24,19],[16,2,16,7],[17,2,17,7],[18,2,18,7],[14,10,14,18],[15,10,15,18],[16,10,16,18],[6,2,7,6],[6,16,6,18],[14,2,14,7],[7,15,7,17],[19,2,19,7],[15,2,15,7],[17,10,17,18],[18,10,18,18],[21,10,21,18],[3,12,3,18],[10,2,10,6],[11,2,11,6],[4,14,4,18],[3,2,3,6],[141,4,141,5],[142,4,142,5],[143,4,143,5],[140,4,140,5],[138,4,138,5],[139,4,139,5],[137,4,137,5],[71,4,71,5],[62,4,62,5],[63,4,63,5],[64,4,64,5],[65,4,65,5],[66,4,66,5],[67,4,67,5],[68,4,68,5],[69,4,69,5],[70,4,70,5],[129,4,129,5],[130,4,130,5],[131,4,131,5],[111,4,111,5],[126,4,126,5],[127,4,127,5],[128,4,128,5],[126,1,126,2],[129,1,129,2],[130,1,130,2],[131,1,131,2],[114,4,114,5],[115,4,115,5],[116,4,116,5],[114,1,114,2],[115,1,115,2],[116,1,116,2],[127,1,127,2],[128,1,128,2],[118,4,118,5],[119,4,119,5],[117,1,117,2],[118,1,118,2],[119,1,119,2],[120,4,120,5],[121,4,121,5],[122,4,122,5],[120,1,120,2],[121,1,121,2],[122,1,122,2],[123,4,123,5],[135,4,135,5],[136,4,136,5],[132,4,132,5],[133,4,133,5],[134,4,134,5],[132,1,132,2],[133,1,133,2],[134,1,134,2],[135,1,135,2],[136,1,136,2],[124,4,124,5],[125,4,125,5],[117,4,117,5],[123,1,123,2],[124,1,124,2],[125,1,125,2],[108,4,108,5],[109,4,109,5],[110,4,110,5],[108,1,108,2],[109,1,109,2],[110,1,110,2],[111,1,111,2],[112,1,112,2],[113,1,113,2],[112,4,112,5],[113,4,113,5],[102,4,102,5],[103,4,103,5],[104,4,104,5],[102,1,102,2],[103,1,103,2],[104,1,104,2],[106,4,106,5],[107,4,107,5],[105,1,105,2],[106,1,106,2],[107,1,107,2],[105,4,105,5],[96,4,96,5],[97,4,97,5],[98,4,98,5],[96,1,96,2],[97,1,97,2],[98,1,98,2],[99,4,99,5],[100,4,100,5],[101,4,101,5],[99,1,99,2],[100,1,100,2],[101,1,101,2],[90,4,90,5],[91,4,91,5],[92,4,92,5],[90,1,90,2],[91,1,91,2],[92,1,92,2],[93,4,93,5],[94,4,94,5],[95,4,95,5],[93,1,93,2],[94,1,94,2],[95,1,95,2],[83,1,83,2],[84,1,84,2],[85,1,85,2],[86,1,86,2],[87,4,87,5],[88,4,88,5],[89,4,89,5],[87,1,87,2],[88,1,88,2],[89,1,89,2],[44,20,44,22],[83,4,83,5],[84,4,84,5],[85,4,85,5],[86,4,86,5],[81,4,81,5],[79,4,79,5],[80,4,80,5],[82,4,82,5],[78,4,78,5],[60,4,60,5],[73,4,73,5],[74,4,74,5],[75,4,75,5],[76,4,76,5],[77,4,77,5],[61,4,61,5],[72,4,72,5],[44,4,44,5],[45,4,45,5],[46,4,46,5],[45,20,45,22],[46,20,46,22],[47,20,47,22],[144,0,145,19],[43,4,43,5],[30,4,42,5],[48,4,48,5],[49,4,49,5],[31,11,43,11],[31,15,43,15],[31,14,43,14],[50,4,50,5],[51,4,51,5],[52,4,52,5],[30,3,43,3],[47,4,47,5],[56,4,56,5],[57,4,57,5],[58,4,58,5],[54,4,54,5],[55,4,55,5],[59,4,59,5],[53,4,53,5],[53,1,53,2],[54,1,54,2],[55,1,55,2],[56,1,56,2],[72,1,72,2],[73,1,73,2],[44,1,44,2],[45,1,45,2],[46,1,46,2],[47,1,47,2],[48,1,48,2],[49,1,49,2],[50,1,50,2],[51,1,51,2],[52,1,52,2],[57,1,57,2],[58,1,58,2],[59,1,59,2],[63,1,63,2],[64,1,64,2],[60,1,60,2],[61,1,61,2],[62,1,62,2],[137,1,137,2],[138,1,138,2],[139,1,139,2],[140,1,140,2],[141,1,141,2],[142,1,142,2],[143,1,143,2],[31,16,43,16],[74,1,74,2],[75,1,75,2],[76,1,76,2],[77,1,77,2],[78,1,78,2],[79,1,79,2],[80,1,80,2],[81,1,81,2],[82,1,82,2],[65,1,65,2],[66,1,66,2],[67,1,67,2],[68,1,68,2],[69,1,69,2],[70,1,70,2],[71,1,71,2],[48,20,48,22],[49,20,49,22],[50,20,50,22],[51,20,51,22],[52,20,52,22],[53,20,53,22],[54,20,54,22],[55,20,55,22],[56,20,56,22],[57,20,57,22],[58,20,58,22],[59,20,59,22],[60,20,60,22],[61,20,61,22],[62,20,62,22],[63,20,63,22],[64,20,64,22],[65,20,65,22],[66,20,66,22],[67,20,67,22],[68,20,68,22],[69,20,69,22],[70,20,70,22],[71,20,71,22],[72,20,72,22],[73,20,73,22],[74,20,74,22],[75,20,75,22],[76,20,76,22],[77,20,77,22],[78,20,78,22],[79,20,79,22],[80,20,80,22],[81,20,81,22],[82,20,82,22],[83,20,83,22],[84,20,84,22],[85,20,85,22],[86,20,86,22],[87,20,87,22],[88,20,88,22],[89,20,89,22],[90,20,90,22],[91,20,91,22],[92,20,92,22],[93,20,93,22],[94,20,94,22],[95,20,95,22],[96,20,96,22],[97,20,97,22],[98,20,98,22],[99,20,99,22],[100,20,100,22],[101,20,101,22],[117,20,117,22],[118,20,118,22],[119,20,119,22],[102,20,102,22],[103,20,103,22],[104,20,104,22],[105,20,105,22],[106,20,106,22],[107,20,107,22],[108,20,108,22],[109,20,109,22],[110,20,110,22],[111,20,111,22],[112,20,112,22],[113,20,113,22],[114,20,114,22],[115,20,115,22],[116,20,116,22],[143,20,143,22],[129,20,129,22],[130,20,130,22],[131,20,131,22],[132,20,132,22],[133,20,133,22],[134,20,134,22],[135,20,135,22],[136,20,136,22],[137,20,137,22],[138,20,138,22],[139,20,139,22],[140,20,140,22],[141,20,141,22],[142,20,142,22],[120,20,120,22],[121,20,121,22],[122,20,122,22],[123,20,123,22],[124,20,124,22],[125,20,125,22],[126,20,126,22],[127,20,127,22],[128,20,128,22]]}
[]
["Analyserekvisition LUFT, KULRØR"]
[]
["Sagsnr.:",null,{"$f":"IF('1. Stamdata'!D22=\"\",\"\",'1. Stamdata'!D22)","v":""},null,null,null,null,"Lokalitetsnr.:",null,null,null,null,{"$f":"IF('1. Stamdata'!N22=\"\",\"\",'1. Stamdata'!N22)","v":""}]
["Lokalitetsnavn:",null,{"$f":"IF('1. Stamdata'!D23=\"\",\"\",'1. Stamdata'!D23)","v":""},null,null,null,null,null,null,null,null,"Region:",null,null,{"$f":"IF('1. Stamdata'!Q23=\"\",\"\",'1. Stamdata'!Q23)","v":""}]
[]
[]
["Prøvetager:",null,null,null,null,null,null,null,null,null,"Leveringstid:"]
[null,null,null,null,null,null,null,null,null,null,"Normal:"]
["Udtagningsdato:",null,null,null,null,null,null,null,null,null,"Dag-til-dag"]
["Indleveringsdato:",null,null,null,null,null,null,null,null,null,"Dag-til-dag (P12):"]
["Rekvisitionsdato:",null,null,null,null,null,null,null,null,null,"Dag-til-dag (P9):"]
[]
[null,null,"Rapportmodtager:",null,null,null,null,null,null,null,"Fakturamodtager:"]
[{"$f":"'1. Stamdata'!$B$26","v":"Firma:"},null,{"$f":"IF('1. Stamdata'!D26=\"\",\"\",'1. Stamdata'!D26)","v":""},null,null,null,null,null,null,null,{"$f":"IF('1. Stamdata'!M26=\"\",\"\",'1. Stamdata'!M26)","v":""}]
[{"$f":"'1. Stamdata'!$B$27","v":"Adresse:"},null,{"$f":"IF('1. Stamdata'!D27=\"\",\"\",'1. Stamdata'!D27)","v":""},null,null,null,null,null,null,null,{"$f":"IF('1. Stamdata'!M27=\"\",\"\",'1. Stamdata'!M27)","v":""}]
[{"$f":"'1. Stamdata'!$B$28","v":"Postnr./By:"},null,{"$f":"IF('1. Stamdata'!D28=\"\",\"\",'1. Stamdata'!D28)","v":""},null,null,null,null,null,null,null,{"$f":"IF('1. Stamdata'!M28=\"\",\"\",'1. Stamdata'!M28)","v":""}]
[{"$f":"'1. Stamdata'!$B$29","v":"Kontaktperson:"},null,{"$f":"IF('1. Stamdata'!D29=\"\",\"\",'1. Stamdata'!D29)","v":""},null,null,null,null,null,null,null,{"$f":"IF('1. Stamdata'!M29=\"\",\"\",'1. Stamdata'!M29)","v":""}]
[{"$f":"'1. Stamdata'!$B$30","v":"Telefonnummer:"},null,{"$f":"IF('1. Stamdata'!D30=\"\",\"\",'1. Stamdata'!D30)","v":""},null,null,null,null,null,null,null,{"$f":"IF('1. Stamdata'!M30=\"\",\"\",'1. Stamdata'!M30)","v":""}]
[{"$f":"'1. Stamdata'!$B31","v":"E-mail | EAN:"},null,{"$f":"IF('1. Stamdata'!D31=\"\",\"\",'1. Stamdata'!D31)","v":""},null,null,null,null,null,null,null,{"$f":"IF('1. Stamdata'!M31=\"\",\"\",'1. Stamdata'!M31)","v":""}]
[{"$f":"'1. Stamdata'!$B32","v":"Personreference:"},null,{"$f":"IF('1. Stamdata'!D32=\"\",\"\",'1. Stamdata'!D32)","v":""},null,null,null,null,null,null,null,{"$f":"IF('1. Stamdata'!M32=\"\",\"\",'1. Stamdata'!M32)","v":""}]
[{"$f":"'1. Stamdata'!$B33","v":"Fakturareference:"},null,null,null,null,null,null,null,null,null,{"$f":"IF('1. Stamdata'!M33=\"\",\"\",'1. Stamdata'!M33)","v":""}]
[{"$f":"'1. Stamdata'!$B34","v":"Fakturering:"},null,null,null,null,null,null,null,null,null,{"$f":"IF('1. Stamdata'!M34=\"\",\"\",'1. Stamdata'!M34)","v":"Månedlig samlefaktura (A)"}]
[]
["Bemærkninger:"]
[]
[]
[]
[]
["Optælling",null,null,null,null,null,{"$f":"COUNTA(G45:G144)","v":0},{"$f":"COUNTA(H45:H144)","v":0},0,0,0,0,0,0,0,{"$f":"IFERROR(IF(COUNTA(A45:C144)=0,\"\",_xlfn.IFS(COUNTA(A45:A144)<>COUNTA(B45:C144),\"SKAL UDFYLDES\",(COUNTA(B45:C144)<>COUNTA(P45:P144)),\"SKAL UDFYLDES\")),\"\")","v":""}]
["Rekvisition udfyldes med \nét kulrør pr. linje",null,null,"Dybde m u.t.","Forbeholdt ALS",null,"KULRØR",null,null,null,null,null,"Andet",null,null,"Supplerende oplysninger"]
[null,null,null,null,null,null,"Kulbrinter + BTEXN + C9 & C10 (6690)","Chlorerede opløsningsmidler (6691)","Kulb+BTEXN+C9&C10+chlor.opl. (6694)","Chlorerede nedbrydningsprod (6692)","Polære opløsningsmidler (6696)","Freon (11, 12, 21, 31, 113, 133a) (6695)",null,null,null,"Luftvolume (l)","Flow (l/min)","Modtryk (mbar)","Start tid (f.eks.kl. 00:00)","Slut tid (f.eks. kl. 23:59)"]
[null,null,null,null,null,null,null,null,null,null,null,null,null,null,null,null,null,null,null,null,null,null,null,"Volume \"/\"","Volume \"-\"",null,null,null,null,null,null,null,null,"Dybde \"-\"","Dybde \"_\"","Start tid TT","Start tid MM","Slut tid TT","Slut tid MM"]
[]
[]
[]
[]
[]
[]
[null,null,null,null,null,null,null,null,null,null,null,null,null,null,null,null,null,null,null,null,null,null,null,"ffdsa","fda"]
[]
[]
[]
["DGU - Filterrør","PrøvestedsID",null,null,"Labnr.",null,null,null,null,null,null,null,null,null,null,null,null,null,null,null,null,null,null,null,null,{"$f":"SUM(Z45:AG144)","v":0},null,null,null,null,null,null,null,null,null,null,"Start tid MM","Slut tid TT","Slut tid MM"]
[null,null,null,null,null,null,null,null,null,null,null,null,null,null,null,null,null,null,null,null,null,null,null,{"$f":"COUNTIF(P45, {\"*/*\"})","v":0},{"$f":"COUNTIF(P45, {\"*-*\"})","v":0},{"$f":"IF((S45>2359),1,0)","v":0},{"$f":"IF(IF(S45=\"\",0,VALUE(RIGHT(S45,2)))>=60,1,0)","v":0},{"$f":"IF((T45>2359),1,0)","v":0},{"$f":"IF(IF(T45=\"\",0,VALUE(RIGHT(T45,2)))>=60,1,0)","v":0},{"$f":"IF(S45=\"\",0,IF(ISNUMBER(S45)=TRUE,0,1))","v":0},{"$f":"COUNTIF($S45, {\"*-*\"})","v":0},{"$f":"IF(T45=\"\",0,IF(ISNUMBER(T45)=TRUE,0,1))","v":0},{"$f":"COUNTIF($T45, {\"*-*\"})","v":0},{"$f":"COUNTIF(D45, {\"*-*\"})-COUNTIF(D45, {\"-*\"})","v":0},{"$f":"COUNTIF(D45, {\"*_*\"})","v":0},{"$f":"IF(S45=\"\",\"\",HOUR(S45))","v":""},{"$f":"IF(S45=\"\",\"\",MINUTE(S45))","v":""},{"$f":"IF(T45=\"\",\"\",HOUR(T45))","v":""},{"$f":"IF(T45=\"\",\"\",MINUTE(T45))","v":""}]
[null,null,null,null,null,null,null,null,null,null,null,null,null,null,null,null,null,null,null,null,null,null,null,{"$f":"COUNTIF(P46, {\"*/*\"})","v":0},{"$f":"COUNTIF(P46, {\"*-*\"})","v":0},{"$f":"IF((S46>2359),1,0)","v":0},{"$f":"IF(IF(S46=\"\",0,VALUE(RIGHT(S46,2)))>=60,1,0)","v":0},{"$f":"IF((T46>2359),1,0)","v":0},{"$f":"IF(IF(T46=\"\",0,VALUE(RIGHT(T46,2)))>=60,1,0)","v":0},{"$f":"IF(S46=\"\",0,IF(ISNUMBER(S46)=TRUE,0,1))","v":0},{"$f":"COUNTIF($S46, {\"*-*\"})","v":0},{"$f":"IF(T46=\"\",0,IF(ISNUMBER(T46)=TRUE,0,1))","v":0},{"$f":"COUNTIF($T46, {\"*-*\"})","v":0},{"$f":"COUNTIF(D46, {\"*-*\"})-COUNTIF(D46, {\"-*\"})","v":0},{"$f":"COUNTIF(D46, {\"*_*\"})","v":0},{"$f":"IF(S46=\"\",\"\",HOUR(S46))","v":""},{"$f":"IF(S46=\"\",\"\",MINUTE(S46))","v":""},{"$f":"IF(T46=\"\",\"\",HOUR(T46))","v":""},{"$f":"IF(T46=\"\",\"\",MINUTE(T46))","v":""}]
[null,null,null,null,null,null,null,null,null,null,null,null,null,null,null,null,null,null,null,null,null,null,null,{"$f":"COUNTIF(P47, {\"*/*\"})","v":0},{"$f":"COUNTIF(P47, {\"*-*\"})","v":0},0,0,0,0,0,{"$f":"COUNTIF($S47, {\"*-*\"})","v":0},0,{"$f":"COUNTIF($T47, {\"*-*\"})","v":0},{"$f":"COUNTIF(D47, {\"*-*\"})-COUNTIF(D47, {\"-*\"})","v":0},{"$f":"COUNTIF(D47, {\"*_*\"})","v":0},"","","",""]
[null,null,null,null,null,null,null,null,null,null,null,null,null,null,null,null,null,null,null,null,null,null,null,{"$f":"COUNTIF(P48, {\"*/*\"})","v":0},{"$f":"COUNTIF(P48, {\"*-*\"})","v":0},0,0,0,0,0,{"$f":"COUNTIF($S48, {\"*-*\"})","v":0},0,{"$f":"COUNTIF($T48, {\"*-*\"})","v":0},{"$f":"COUNTIF(D48, {\"*-*\"})-COUNTIF(D48, {\"-*\"})","v":0},{"$f":"COUNTIF(D48, {\"*_*\"})","v":0},"","","",""]
[null,null,null,null,null,null,null,null,null,null,null,null,null,null,null,null,null,null,null,null,null,null,null,{"$f":"COUNTIF(P49, {\"*/*\"})","v":0},{"$f":"COUNTIF(P49, {\"*-*\"})","v":0},0,0,0,0,0,{"$f":"COUNTIF($S49, {\"*-*\"})","v":0},0,{"$f":"COUNTIF($T49, {\"*-*\"})","v":0},{"$f":"COUNTIF(D49, {\"*-*\"})-COUNTIF(D49, {\"-*\"})","v":0},{"$f":"COUNTIF(D49, {\"*_*\"})","v":0},"","","",""]
[null,null,null,null,null,null,null,null,null,null,null,null,null,null,null,null,null,null,null,null,null,null,null,{"$f":"COUNTIF(P50, {\"*/*\"})","v":0},{"$f":"COUNTIF(P50, {\"*-*\"})","v":0},0,0,0,0,0,{"$f":"COUNTIF($S50, {\"*-*\"})","v":0},0,{"$f":"COUNTIF($T50, {\"*-*\"})","v":0},{"$f":"COUNTIF(D50, {\"*-*\"})-COUNTIF(D50, {\"-*\"})","v":0},{"$f":"COUNTIF(D50, {\"*_*\"})","v":0},"","","",""]
[null,null,null,null,null,null,null,null,null,null,null,null,null,null,null,null,null,null,null,null,null,null,null,{"$f":"COUNTIF(P51, {\"*/*\"})","v":0},{"$f":"COUNTIF(P51, {\"*-*\"})","v":0},0,0,0,0,0,{"$f":"COUNTIF($S51, {\"*-*\"})","v":0},0,{"$f":"COUNTIF($T51, {\"*-*\"})","v":0},{"$f":"COUNTIF(D51, {\"*-*\"})-COUNTIF(D51, {\"-*\"})","v":0},{"$f":"COUNTIF(D51, {\"*_*\"})","v":0},"","","",""]
[null,null,null,null,null,null,null,null,null,null,null,null,null,null,null,null,null,null,null,null,null,null,null,{"$f":"COUNTIF(P52, {\"*/*\"})","v":0},{"$f":"COUNTIF(P52, {\"*-*\"})","v":0},0,0,0,0,0,{"$f":"COUNTIF($S52, {\"*-*\"})","v":0},0,{"$f":"COUNTIF($T52, {\"*-*\"})","v":0},{"$f":"COUNTIF(D52, {\"*-*\"})-COUNTIF(D52, {\"-*\"})","v":0},{"$f":"COUNTIF(D52, {\"*_*\"})","v":0},"","","",""]
[null,null,null,null,null,null,null,null,null,null,null,null,null,null,null,null,null,null,null,null,null,null,null,{"$f":"COUNTIF(P53, {\"*/*\"})","v":0},{"$f":"COUNTIF(P53, {\"*-*\"})","v":0},0,0,0,0,0,{"$f":"COUNTIF($S53, {\"*-*\"})","v":0},0,{"$f":"COUNTIF($T53, {\"*-*\"})","v":0},{"$f":"COUNTIF(D53, {\"*-*\"})-COUNTIF(D53, {\"-*\"})","v":0},{"$f":"COUNTIF(D53, {\"*_*\"})","v":0},"","","",""]
[null,null,null,null,null,null,null,null,null,null,null,null,null,null,null,null,null,null,null,null,null,null,null,{"$f":"COUNTIF(P54, {\"*/*\"})","v":0},{"$f":"COUNTIF(P54, {\"*-*\"})","v":0},0,0,0,0,0,{"$f":"COUNTIF($S54, {\"*-*\"})","v":0},0,{"$f":"COUNTIF($T54, {\"*-*\"})","v":0},{"$f":"COUNTIF(D54, {\"*-*\"})-COUNTIF(D54, {\"-*\"})","v":0},{"$f":"COUNTIF(D54, {\"*_*\"})","v":0},"","","",""]
[null,null,null,null,null,null,null,null,null,null,null,null,null,null,null,null,null,null,null,null,null,null,null,{"$f":"COUNTIF(P55, {\"*/*\"})","v":0},{"$f":"COUNTIF(P55, {\"*-*\"})","v":0},0,0,0,0,0,{"$f":"COUNTIF($S55, {\"*-*\"})","v":0},0,{"$f":"COUNTIF($T55, {\"*-*\"})","v":0},{"$f":"COUNTIF(D55, {\"*-*\"})-COUNTIF(D55, {\"-*\"})","v":0},{"$f":"COUNTIF(D55, {\"*_*\"})","v":0},"","","",""]
[null,null,null,null,null,null,null,null,null,null,null,null,null,null,null,null,null,null,null,null,null,null,null,{"$f":"COUNTIF(P56, {\"*/*\"})","v":0},{"$f":"COUNTIF(P56, {\"*-*\"})","v":0},0,0,0,0,0,{"$f":"COUNTIF($S56, {\"*-*\"})","v":0},0,{"$f":"COUNTIF($T56, {\"*-*\"})","v":0},{"$f":"COUNTIF(D56, {\"*-*\"})-COUNTIF(D56, {\"-*\"})","v":0},{"$f":"COUNTIF(D56, {\"*_*\"})","v":0},"","","",""]
[null,null,null,null,null,null,null,null,null,null,null,null,null,null,null,null,null,null,null,null,null,null,null,{"$f":"COUNTIF(P57, {\"*/*\"})","v":0},{"$f":"COUNTIF(P57, {\"*-*\"})","v":0},0,0,0,0,0,{"$f":"COUNTIF($S57, {\"*-*\"})","v":0},0,{"$f":"COUNTIF($T57, {\"*-*\"})","v":0},{"$f":"COUNTIF(D57, {\"*-*\"})-COUNTIF(D57, {\"-*\"})","v":0},{"$f":"COUNTIF(D57, {\"*_*\"})","v":0},"","","",""]
[null,null,null,null,null,null,null,null,null,null,null,null,null,null,null,null,null,null,null,null,null,null,null,{"$f":"COUNTIF(P58, {\"*/*\"})","v":0},{"$f":"COUNTIF(P58, {\"*-*\"})","v":0},0,0,0,0,0,{"$f":"COUNTIF($S58, {\"*-*\"})","v":0},0,{"$f":"COUNTIF($T58, {\"*-*\"})","v":0},{"$f":"COUNTIF(D58, {\"*-*\"})-COUNTIF(D58, {\"-*\"})","v":0},{"$f":"COUNTIF(D58, {\"*_*\"})","v":0},"","","",""]
[null,null,null,null,null,null,null,null,null,null,null,null,null,null,null,null,null,null,null,null,null,null,null,{"$f":"COUNTIF(P59, {\"*/*\"})","v":0},{"$f":"COUNTIF(P59, {\"*-*\"})","v":0},0,0,0,0,0,{"$f":"COUNTIF($S59, {\"*-*\"})","v":0},0,{"$f":"COUNTIF($T59, {\"*-*\"})","v":0},{"$f":"COUNTIF(D59, {\"*-*\"})-COUNTIF(D59, {\"-*\"})","v":0},{"$f":"COUNTIF(D59, {\"*_*\"})","v":0},"","","",""]
[null,null,null,null,null,null,null,null,null,null,null,null,null,null,null,null,null,null,null,null,null,null,null,{"$f":"COUNTIF(P60, {\"*/*\"})","v":0},{"$f":"COUNTIF(P60, {\"*-*\"})","v":0},0,0,0,0,0,{"$f":"COUNTIF($S60, {\"*-*\"})","v":0},0,{"$f":"COUNTIF($T60, {\"*-*\"})","v":0},{"$f":"COUNTIF(D60, {\"*-*\"})-COUNTIF(D60, {\"-*\"})","v":0},{"$f":"COUNTIF(D60, {\"*_*\"})","v":0},"","","",""]
[null,null,null,null,null,null,null,null,null,null,null,null,null,null,null,null,null,null,null,null,null,null,null,{"$f":"COUNTIF(P61, {\"*/*\"})","v":0},{"$f":"COUNTIF(P61, {\"*-*\"})","v":0},0,0,0,0,0,{"$f":"COUNTIF($S61, {\"*-*\"})","v":0},0,{"$f":"COUNTIF($T61, {\"*-*\"})","v":0},{"$f":"COUNTIF(D61, {\"*-*\"})-COUNTIF(D61, {\"-*\"})","v":0},{"$f":"COUNTIF(D61, {\"*_*\"})","v":0},"","","",""]
[null,null,null,null,null,null,null,null,null,null,null,null,null,null,null,null,null,null,null,null,null,null,null,{"$f":"COUNTIF(P62, {\"*/*\"})","v":0},{"$f":"COUNTIF(P62, {\"*-*\"})","v":0},0,0,0,0,0,{"$f":"COUNTIF($S62, {\"*-*\"})","v":0},0,{"$f":"COUNTIF($T62, {\"*-*\"})","v":0},{"$f":"COUNTIF(D62, {\"*-*\"})-COUNTIF(D62, {\"-*\"})","v":0},{"$f":"COUNTIF(D62, {\"*_*\"})","v":0},"","","",""]
[null,null,null,null,null,null,null,null,null,null,null,null,null,null,null,null,null,null,null,null,null,null,null,{"$f":"COUNTIF(P63, {\"*/*\"})","v":0},{"$f":"COUNTIF(P63, {\"*-*\"})","v":0},0,0,0,0,0,{"$f":"COUNTIF($S63, {\"*-*\"})","v":0},0,{"$f":"COUNTIF($T63, {\"*-*\"})","v":0},{"$f":"COUNTIF(D63, {\"*-*\"})-COUNTIF(D63, {\"-*\"})","v":0},{"$f":"COUNTIF(D63, {\"*_*\"})","v":0},"","","",""]
[null,null,null,null,null,null,null,null,null,null,null,null,null,null,null,null,null,null,null,null,null,null,null,{"$f":"COUNTIF(P64, {\"*/*\"})","v":0},{"$f":"COUNTIF(P64, {\"*-*\"})","v":0},0,0,0,0,0,{"$f":"COUNTIF($S64, {\"*-*\"})","v":0},0,{"$f":"COUNTIF($T64, {\"*-*\"})","v":0},{"$f":"COUNTIF(D64, {\"*-*\"})-COUNTIF(D64, {\"-*\"})","v":0},{"$f":"COUNTIF(D64, {\"*_*\"})","v":0},"","","",""]
[null,null,null,null,null,null,null,null,null,null,null,null,null,null,null,null,null,null,null,null,null,null,null,{"$f":"COUNTIF(P65, {\"*/*\"})","v":0},{"$f":"COUNTIF(P65, {\"*-*\"})","v":0},0,0,0,0,0,{"$f":"COUNTIF($S65, {\"*-*\"})","v":0},0,{"$f":"COUNTIF($T65, {\"*-*\"})","v":0},{"$f":"COUNTIF(D65, {\"*-*\"})-COUNTIF(D65, {\"-*\"})","v":0},{"$f":"COUNTIF(D65, {\"*_*\"})","v":0},"","","",""]
[null,null,null,null,null,null,null,null,null,null,null,null,null,null,null,null,null,null,null,null,null,null,null,{"$f":"COUNTIF(P66, {\"*/*\"})","v":0},{"$f":"COUNTIF(P66, {\"*-*\"})","v":0},0,0,0,0,0,{"$f":"COUNTIF($S66, {\"*-*\"})","v":0},0,{"$f":"COUNTIF($T66, {\"*-*\"})","v":0},{"$f":"COUNTIF(D66, {\"*-*\"})-COUNTIF(D66, {\"-*\"})","v":0},{"$f":"COUNTIF(D66, {\"*_*\"})","v":0},"","","",""]
[null,null,null,null,null,null,null,null,null,null,null,null,null,null,null,null,null,null,null,null,null,null,null,{"$f":"COUNTIF(P67, {\"*/*\"})","v":0},{"$f":"COUNTIF(P67, {\"*-*\"})","v":0},0,0,0,0,0,{"$f":"COUNTIF($S67, {\"*-*\"})","v":0},0,{"$f":"COUNTIF($T67, {\"*-*\"})","v":0},{"$f":"COUNTIF(D67, {\"*-*\"})-COUNTIF(D67, {\"-*\"})","v":0},{"$f":"COUNTIF(D67, {\"*_*\"})","v":0},"","","",""]
[null,null,null,null,null,null,null,null,null,null,null,null,null,null,null,null,null,null,null,null,null,null,null,{"$f":"COUNTIF(P68, {\"*/*\"})","v":0},{"$f":"COUNTIF(P68, {\"*-*\"})","v":0},0,0,0,0,0,{"$f":"COUNTIF($S68, {\"*-*\"})","v":0},0,{"$f":"COUNTIF($T68, {\"*-*\"})","v":0},{"$f":"COUNTIF(D68, {\"*-*\"})-COUNTIF(D68, {\"-*\"})","v":0},{"$f":"COUNTIF(D68, {\"*_*\"})","v":0},"","","",""]
[null,null,null,null,null,null,null,null,null,null,null,null,null,null,null,null,null,null,null,null,null,null,null,{"$f":"COUNTIF(P69, {\"*/*\"})","v":0},{"$f":"COUNTIF(P69, {\"*-*\"})","v":0},0,0,0,0,0,{"$f":"COUNTIF($S69, {\"*-*\"})","v":0},0,{"$f":"COUNTIF($T69, {\"*-*\"})","v":0},{"$f":"COUNTIF(D69, {\"*-*\"})-COUNTIF(D69, {\"-*\"})","v":0},{"$f":"COUNTIF(D69, {\"*_*\"})","v":0},"","","",""]
[null,null,null,null,null,null,null,null,null,null,null,null,null,null,null,null,null,null,null,null,null,null,null,{"$f":"COUNTIF(P70, {\"*/*\"})","v":0},{"$f":"COUNTIF(P70, {\"*-*\"})","v":0},0,0,0,0,0,{"$f":"COUNTIF($S70, {\"*-*\"})","v":0},0,{"$f":"COUNTIF($T70, {\"*-*\"})","v":0},{"$f":"COUNTIF(D70, {\"*-*\"})-COUNTIF(D70, {\"-*\"})","v":0},{"$f":"COUNTIF(D70, {\"*_*\"})","v":0},"","","",""]
[null,null,null,null,null,null,null,null,null,null,null,null,null,null,null,null,null,null,null,null,null,null,null,{"$f":"COUNTIF(P71, {\"*/*\"})","v":0},{"$f":"COUNTIF(P71, {\"*-*\"})","v":0},0,0,0,0,0,{"$f":"COUNTIF($S71, {\"*-*\"})","v":0},0,{"$f":"COUNTIF($T71, {\"*-*\"})","v":0},{"$f":"COUNTIF(D71, {\"*-*\"})-COUNTIF(D71, {\"-*\"})","v":0},{"$f":"COUNTIF(D71, {\"*_*\"})","v":0},"","","",""]
[null,null,null,null,null,null,null,null,null,null,null,null,null,null,null,null,null,null,null,null,null,null,null,{"$f":"COUNTIF(P72, {\"*/*\"})","v":0},{"$f":"COUNTIF(P72, {\"*-*\"})","v":0},0,0,0,0,0,{"$f":"COUNTIF($S72, {\"*-*\"})","v":0},0,{"$f":"COUNTIF($T72, {\"*-*\"})","v":0},{"$f":"COUNTIF(D72, {\"*-*\"})-COUNTIF(D72, {\"-*\"})","v":0},{"$f":"COUNTIF(D72, {\"*_*\"})","v":0},"","","",""]
[null,null,null,null,null,null,null,null,null,null,null,null,null,null,null,null,null,null,null,null,null,null,null,{"$f":"COUNTIF(P73, {\"*/*\"})","v":0},{"$f":"COUNTIF(P73, {\"*-*\"})","v":0},0,0,0,0,0,{"$f":"COUNTIF($S73, {\"*-*\"})","v":0},0,{"$f":"COUNTIF($T73, {\"*-*\"})","v":0},{"$f":"COUNTIF(D73, {\"*-*\"})-COUNTIF(D73, {\"-*\"})","v":0},{"$f":"COUNTIF(D73, {\"*_*\"})","v":0},"","","",""]
[null,null,null,null,null,null,null,null,null,null,null,null,null,null,null,null,null,null,null,null,null,null,null,{"$f":"COUNTIF(P74, {\"*/*\"})","v":0},{"$f":"COUNTIF(P74, {\"*-*\"})","v":0},0,0,0,0,0,{"$f":"COUNTIF($S74, {\"*-*\"})","v":0},0,{"$f":"COUNTIF($T74, {\"*-*\"})","v":0},{"$f":"COUNTIF(D74, {\"*-*\"})-COUNTIF(D74, {\"-*\"})","v":0},{"$f":"COUNTIF(D74, {\"*_*\"})","v":0},"","","",""]
[null,null,null,null,null,null,null,null,null,null,null,null,null,null,null,null,null,null,null,null,null,null,null,{"$f":"COUNTIF(P75, {\"*/*\"})","v":0},{"$f":"COUNTIF(P75, {\"*-*\"})","v":0},0,0,0,0,0,{"$f":"COUNTIF($S75, {\"*-*\"})","v":0},0,{"$f":"COUNTIF($T75, {\"*-*\"})","v":0},{"$f":"COUNTIF(D75, {\"*-*\"})-COUNTIF(D75, {\"-*\"})","v":0},{"$f":"COUNTIF(D75, {\"*_*\"})","v":0},"","","",""]
[null,null,null,null,null,null,null,null,null,null,null,null,null,null,null,null,null,null,null,null,null,null,null,{"$f":"COUNTIF(P76, {\"*/*\"})","v":0},{"$f":"COUNTIF(P76, {\"*-*\"})","v":0},0,0,0,0,0,{"$f":"COUNTIF($S76, {\"*-*\"})","v":0},0,{"$f":"COUNTIF($T76, {\"*-*\"})","v":0},{"$f":"COUNTIF(D76, {\"*-*\"})-COUNTIF(D76, {\"-*\"})","v":0},{"$f":"COUNTIF(D76, {\"*_*\"})","v":0},"","","",""]
[null,null,null,null,null,null,null,null,null,null,null,null,null,null,null,null,null,null,null,null,null,null,null,{"$f":"COUNTIF(P77, {\"*/*\"})","v":0},{"$f":"COUNTIF(P77, {\"*-*\"})","v":0},0,0,0,0,0,{"$f":"COUNTIF($S77, {\"*-*\"})","v":0},0,{"$f":"COUNTIF($T77, {\"*-*\"})","v":0},{"$f":"COUNTIF(D77, {\"*-*\"})-COUNTIF(D77, {\"-*\"})","v":0},{"$f":"COUNTIF(D77, {\"*_*\"})","v":0},"","","",""]
[null,null,null,null,null,null,null,null,null,null,null,null,null,null,null,null,null,null,null,null,null,null,null,{"$f":"COUNTIF(P78, {\"*/*\"})","v":0},{"$f":"COUNTIF(P78, {\"*-*\"})","v":0},0,0,0,0,0,{"$f":"COUNTIF($S78, {\"*-*\"})","v":0},0,{"$f":"COUNTIF($T78, {\"*-*\"})","v":0},{"$f":"COUNTIF(D78, {\"*-*\"})-COUNTIF(D78, {\"-*\"})","v":0},{"$f":"COUNTIF(D78, {\"*_*\"})","v":0},"","","",""]
[null,null,null,null,null,null,null,null,null,null,null,null,null,null,null,null,null,null,null,null,null,null,null,{"$f":"COUNTIF(P79, {\"*/*\"})","v":0},{"$f":"COUNTIF(P79, {\"*-*\"})","v":0},0,0,0,0,0,{"$f":"COUNTIF($S79, {\"*-*\"})","v":0},0,{"$f":"COUNTIF($T79, {\"*-*\"})","v":0},{"$f":"COUNTIF(D79, {\"*-*\"})-COUNTIF(D79, {\"-*\"})","v":0},{"$f":"COUNTIF(D79, {\"*_*\"})","v":0},"","","",""]
[null,null,null,null,null,null,null,null,null,null,null,null,null,null,null,null,null,null,null,null,null,null,null,{"$f":"COUNTIF(P80, {\"*/*\"})","v":0},{"$f":"COUNTIF(P80, {\"*-*\"})","v":0},0,0,0,0,0,{"$f":"COUNTIF($S80, {\"*-*\"})","v":0},0,{"$f":"COUNTIF($T80, {\"*-*\"})","v":0},{"$f":"COUNTIF(D80, {\"*-*\"})-COUNTIF(D80, {\"-*\"})","v":0},{"$f":"COUNTIF(D80, {\"*_*\"})","v":0},"","","",""]
[null,null,null,null,null,null,null,null,null,null,null,null,null,null,null,null,null,null,null,null,null,null,null,{"$f":"COUNTIF(P81, {\"*/*\"})","v":0},{"$f":"COUNTIF(P81, {\"*-*\"})","v":0},0,0,0,0,0,{"$f":"COUNTIF($S81, {\"*-*\"})","v":0},0,{"$f":"COUNTIF($T81, {\"*-*\"})","v":0},{"$f":"COUNTIF(D81, {\"*-*\"})-COUNTIF(D81, {\"-*\"})","v":0},{"$f":"COUNTIF(D81, {\"*_*\"})","v":0},"","","",""]
[null,null,null,null,null,null,null,null,null,null,null,null,null,null,null,null,null,null,null,null,null,null,null,{"$f":"COUNTIF(P82, {\"*/*\"})","v":0},{"$f":"COUNTIF(P82, {\"*-*\"})","v":0},0,0,0,0,0,{"$f":"COUNTIF($S82, {\"*-*\"})","v":0},0,{"$f":"COUNTIF($T82, {\"*-*\"})","v":0},{"$f":"COUNTIF(D82, {\"*-*\"})-COUNTIF(D82, {\"-*\"})","v":0},{"$f":"COUNTIF(D82, {\"*_*\"})","v":0},"","","",""]
[null,null,null,null,null,null,null,null,null,null,null,null,null,null,null,null,null,null,null,null,null,null,null,{"$f":"COUNTIF(P83, {\"*/*\"})","v":0},{"$f":"COUNTIF(P83, {\"*-*\"})","v":0},0,0,0,0,0,{"$f":"COUNTIF($S83, {\"*-*\"})","v":0},0,{"$f":"COUNTIF($T83, {\"*-*\"})","v":0},{"$f":"COUNTIF(D83, {\"*-*\"})-COUNTIF(D83, {\"-*\"})","v":0},{"$f":"COUNTIF(D83, {\"*_*\"})","v":0},"","","",""]
[null,null,null,null,null,null,null,null,null,null,null,null,null,null,null,null,null,null,null,null,null,null,null,{"$f":"COUNTIF(P84, {\"*/*\"})","v":0},{"$f":"COUNTIF(P84, {\"*-*\"})","v":0},0,0,0,0,0,{"$f":"COUNTIF($S84, {\"*-*\"})","v":0},0,{"$f":"COUNTIF($T84, {\"*-*\"})","v":0},{"$f":"COUNTIF(D84, {\"*-*\"})-COUNTIF(D84, {\"-*\"})","v":0},{"$f":"COUNTIF(D84, {\"*_*\"})","v":0},"","","",""]
[null,null,null,null,null,null,null,null,null,null,null,null,null,null,null,null,null,null,null,null,null,null,null,{"$f":"COUNTIF(P85, {\"*/*\"})","v":0},{"$f":"COUNTIF(P85, {\"*-*\"})","v":0},0,0,0,0,0,{"$f":"COUNTIF($S85, {\"*-*\"})","v":0},0,{"$f":"COUNTIF($T85, {\"*-*\"})","v":0},{"$f":"COUNTIF(D85, {\"*-*\"})-COUNTIF(D85, {\"-*\"})","v":0},{"$f":"COUNTIF(D85, {\"*_*\"})","v":0},"","","",""]
[null,null,null,null,null,null,null,null,null,null,null,null,null,null,null,null,null,null,null,null,null,null,null,{"$f":"COUNTIF(P86, {\"*/*\"})","v":0},{"$f":"COUNTIF(P86, {\"*-*\"})","v":0},0,0,0,0,0,{"$f":"COUNTIF($S86, {\"*-*\"})","v":0},0,{"$f":"COUNTIF($T86, {\"*-*\"})","v":0},{"$f":"COUNTIF(D86, {\"*-*\"})-COUNTIF(D86, {\"-*\"})","v":0},{"$f":"COUNTIF(D86, {\"*_*\"})","v":0},"","","",""]
[null,null,null,null,null,null,null,null,null,null,null,null,null,null,null,null,null,null,null,null,null,null,null,{"$f":"COUNTIF(P87, {\"*/*\"})","v":0},{"$f":"COUNTIF(P87, {\"*-*\"})","v":0},0,0,0,0,0,{"$f":"COUNTIF($S87, {\"*-*\"})","v":0},0,{"$f":"COUNTIF($T87, {\"*-*\"})","v":0},{"$f":"COUNTIF(D87, {\"*-*\"})-COUNTIF(D87, {\"-*\"})","v":0},{"$f":"COUNTIF(D87, {\"*_*\"})","v":0},"","","",""]
[null,null,null,null,null,null,null,null,null,null,null,null,null,null,null,null,null,null,null,null,null,null,null,{"$f":"COUNTIF(P88, {\"*/*\"})","v":0},{"$f":"COUNTIF(P88, {\"*-*\"})","v":0},0,0,0,0,0,{"$f":"COUNTIF($S88, {\"*-*\"})","v":0},0,{"$f":"COUNTIF($T88, {\"*-*\"})","v":0},{"$f":"COUNTIF(D88, {\"*-*\"})-COUNTIF(D88, {\"-*\"})","v":0},{"$f":"COUNTIF(D88, {\"*_*\"})","v":0},"","","",""]
[null,null,null,null,null,null,null,null,null,null,null,null,null,null,null,null,null,null,null,null,null,null,null,{"$f":"COUNTIF(P89, {\"*/*\"})","v":0},{"$f":"COUNTIF(P89, {\"*-*\"})","v":0},0,0,0,0,0,{"$f":"COUNTIF($S89, {\"*-*\"})","v":0},0,{"$f":"COUNTIF($T89, {\"*-*\"})","v":0},{"$f":"COUNTIF(D89, {\"*-*\"})-COUNTIF(D89, {\"-*\"})","v":0},{"$f":"COUNTIF(D89, {\"*_*\"})","v":0},"","","",""]
[null,null,null,null,null,null,null,null,null,null,null,null,null,null,null,null,null,null,null,null,null,null,null,{"$f":"COUNTIF(P90, {\"*/*\"})","v":0},{"$f":"COUNTIF(P90, {\"*-*\"})","v":0},0,0,0,0,0,{"$f":"COUNTIF($S90, {\"*-*\"})","v":0},0,{"$f":"COUNTIF($T90, {\"*-*\"})","v":0},{"$f":"COUNTIF(D90, {\"*-*\"})-COUNTIF(D90, {\"-*\"})","v":0},{"$f":"COUNTIF(D90, {\"*_*\"})","v":0},"","","",""]
[null,null,null,null,null,null,null,null,null,null,null,null,null,null,null,null,null,null,null,null,null,null,null,{"$f":"COUNTIF(P91, {\"*/*\"})","v":0},{"$f":"COUNTIF(P91, {\"*-*\"})","v":0},0,0,0,0,0,{"$f":"COUNTIF($S91, {\"*-*\"})","v":0},0,{"$f":"COUNTIF($T91, {\"*-*\"})","v":0},{"$f":"COUNTIF(D91, {\"*-*\"})-COUNTIF(D91, {\"-*\"})","v":0},{"$f":"COUNTIF(D91, {\"*_*\"})","v":0},"","","",""]
[null,null,null,null,null,null,null,null,null,null,null,null,null,null,null,null,null,null,null,null,null,null,null,{"$f":"COUNTIF(P92, {\"*/*\"})","v":0},{"$f":"COUNTIF(P92, {\"*-*\"})","v":0},0,0,0,0,0,{"$f":"COUNTIF($S92, {\"*-*\"})","v":0},0,{"$f":"COUNTIF($T92, {\"*-*\"})","v":0},{"$f":"COUNTIF(D92, {\"*-*\"})-COUNTIF(D92, {\"-*\"})","v":0},{"$f":"COUNTIF(D92, {\"*_*\"})","v":0},"","","",""]
[null,null,null,null,null,null,null,null,null,null,null,null,null,null,null,null,null,null,null,null,null,null,null,{"$f":"COUNTIF(P93, {\"*/*\"})","v":0},{"$f":"COUNTIF(P93, {\"*-*\"})","v":0},0,0,0,0,0,{"$f":"COUNTIF($S93, {\"*-*\"})","v":0},0,{"$f":"COUNTIF($T93, {\"*-*\"})","v":0},{"$f":"COUNTIF(D93, {\"*-*\"})-COUNTIF(D93, {\"-*\"})","v":0},{"$f":"COUNTIF(D93, {\"*_*\"})","v":0},"","","",""]
[null,null,null,null,null,null,null,null,null,null,null,null,null,null,null,null,null,null,null,null,null,null,null,{"$f":"COUNTIF(P94, {\"*/*\"})","v":0},{"$f":"COUNTIF(P94, {\"*-*\"})","v":0},0,0,0,0,0,{"$f":"COUNTIF($S94, {\"*-*\"})","v":0},0,{"$f":"COUNTIF($T94, {\"*-*\"})","v":0},{"$f":"COUNTIF(D94, {\"*-*\"})-COUNTIF(D94, {\"-*\"})","v":0},{"$f":"COUNTIF(D94, {\"*_*\"})","v":0},"","","",""]
[null,null,null,null,null,null,null,null,null,null,null,null,null,null,null,null,null,null,null,null,null,null,null,{"$f":"COUNTIF(P95, {\"*/*\"})","v":0},{"$f":"COUNTIF(P95, {\"*-*\"})","v":0},0,0,0,0,0,{"$f":"COUNTIF($S95, {\"*-*\"})","v":0},0,{"$f":"COUNTIF($T95, {\"*-*\"})","v":0},{"$f":"COUNTIF(D95, {\"*-*\"})-COUNTIF(D95, {\"-*\"})","v":0},{"$f":"COUNTIF(D95, {\"*_*\"})","v":0},"","","",""]
[null,null,null,null,null,null,null,null,null,null,null,null,null,null,null,null,null,null,null,null,null,null,null,{"$f":"COUNTIF(P96, {\"*/*\"})","v":0},{"$f":"COUNTIF(P96, {\"*-*\"})","v":0},0,0,0,0,0,{"$f":"COUNTIF($S96, {\"*-*\"})","v":0},0,{"$f":"COUNTIF($T96, {\"*-*\"})","v":0},{"$f":"COUNTIF(D96, {\"*-*\"})-COUNTIF(D96, {\"-*\"})","v":0},{"$f":"COUNTIF(D96, {\"*_*\"})","v":0},"","","",""]
[null,null,null,null,null,null,null,null,null,null,null,null,null,null,null,null,null,null,null,null,null,null,null,{"$f":"COUNTIF(P97, {\"*/*\"})","v":0},{"$f":"COUNTIF(P97, {\"*-*\"})","v":0},0,0,0,0,0,{"$f":"COUNTIF($S97, {\"*-*\"})","v":0},0,{"$f":"COUNTIF($T97, {\"*-*\"})","v":0},{"$f":"COUNTIF(D97, {\"*-*\"})-COUNTIF(D97, {\"-*\"})","v":0},{"$f":"COUNTIF(D97, {\"*_*\"})","v":0},"","","",""]
[null,null,null,null,null,null,null,null,null,null,null,null,null,null,null,null,null,null,null,null,null,null,null,{"$f":"COUNTIF(P98, {\"*/*\"})","v":0},{"$f":"COUNTIF(P98, {\"*-*\"})","v":0},0,0,0,0,0,{"$f":"COUNTIF($S98, {\"*-*\"})","v":0},0,{"$f":"COUNTIF($T98, {\"*-*\"})","v":0},{"$f":"COUNTIF(D98, {\"*-*\"})-COUNTIF(D98, {\"-*\"})","v":0},{"$f":"COUNTIF(D98, {\"*_*\"})","v":0},"","","",""]
[null,null,null,null,null,null,null,null,null,null,null,null,null,null,null,null,null,null,null,null,null,null,null,{"$f":"COUNTIF(P99, {\"*/*\"})","v":0},{"$f":"COUNTIF(P99, {\"*-*\"})","v":0},0,0,0,0,0,{"$f":"COUNTIF($S99, {\"*-*\"})","v":0},0,{"$f":"COUNTIF($T99, {\"*-*\"})","v":0},{"$f":"COUNTIF(D99, {\"*-*\"})-COUNTIF(D99, {\"-*\"})","v":0},{"$f":"COUNTIF(D99, {\"*_*\"})","v":0},"","","",""]
[null,null,null,null,null,null,null,null,null,null,null,null,null,null,null,null,null,null,null,null,null,null,null,{"$f":"COUNTIF(P100, {\"*/*\"})","v":0},{"$f":"COUNTIF(P100, {\"*-*\"})","v":0},0,0,0,0,0,{"$f":"COUNTIF($S100, {\"*-*\"})","v":0},0,{"$f":"COUNTIF($T100, {\"*-*\"})","v":0},{"$f":"COUNTIF(D100, {\"*-*\"})-COUNTIF(D100, {\"-*\"})","v":0},{"$f":"COUNTIF(D100, {\"*_*\"})","v":0},"","","",""]
[null,null,null,null,null,null,null,null,null,null,null,null,null,null,null,null,null,null,null,null,null,null,null,{"$f":"COUNTIF(P101, {\"*/*\"})","v":0},{"$f":"COUNTIF(P101, {\"*-*\"})","v":0},0,0,0,0,0,{"$f":"COUNTIF($S101, {\"*-*\"})","v":0},0,{"$f":"COUNTIF($T101, {\"*-*\"})","v":0},{"$f":"COUNTIF(D101, {\"*-*\"})-COUNTIF(D101, {\"-*\"})","v":0},{"$f":"COUNTIF(D101, {\"*_*\"})","v":0},"","","",""]
[null,null,null,null,null,null,null,null,null,null,null,null,null,null,null,null,null,null,null,null,null,null,null,{"$f":"COUNTIF(P102, {\"*/*\"})","v":0},{"$f":"COUNTIF(P102, {\"*-*\"})","v":0},0,0,0,0,0,{"$f":"COUNTIF($S102, {\"*-*\"})","v":0},0,{"$f":"COUNTIF($T102, {\"*-*\"})","v":0},{"$f":"COUNTIF(D102, {\"*-*\"})-COUNTIF(D102, {\"-*\"})","v":0},{"$f":"COUNTIF(D102, {\"*_*\"})","v":0},"","","",""]
[null,null,null,null,null,null,null,null,null,null,null,null,null,null,null,null,null,null,null,null,null,null,null,{"$f":"COUNTIF(P103, {\"*/*\"})","v":0},{"$f":"COUNTIF(P103, {\"*-*\"})","v":0},0,0,0,0,0,{"$f":"COUNTIF($S103, {\"*-*\"})","v":0},0,{"$f":"COUNTIF($T103, {\"*-*\"})","v":0},{"$f":"COUNTIF(D103, {\"*-*\"})-COUNTIF(D103, {\"-*\"})","v":0},{"$f":"COUNTIF(D103, {\"*_*\"})","v":0},"","","",""]
[null,null,null,null,null,null,null,null,null,null,null,null,null,null,null,null,null,null,null,null,null,null,null,{"$f":"COUNTIF(P104, {\"*/*\"})","v":0},{"$f":"COUNTIF(P104, {\"*-*\"})","v":0},0,0,0,0,0,{"$f":"COUNTIF($S104, {\"*-*\"})","v":0},0,{"$f":"COUNTIF($T104, {\"*-*\"})","v":0},{"$f":"COUNTIF(D104, {\"*-*\"})-COUNTIF(D104, {\"-*\"})","v":0},{"$f":"COUNTIF(D104, {\"*_*\"})","v":0},"","","",""]
[null,null,null,null,null,null,null,null,null,null,null,null,null,null,null,null,null,null,null,null,null,null,null,{"$f":"COUNTIF(P105, {\"*/*\"})","v":0},{"$f":"COUNTIF(P105, {\"*-*\"})","v":0},0,0,0,0,0,{"$f":"COUNTIF($S105, {\"*-*\"})","v":0},0,{"$f":"COUNTIF($T105, {\"*-*\"})","v":0},{"$f":"COUNTIF(D105, {\"*-*\"})-COUNTIF(D105, {\"-*\"})","v":0},{"$f":"COUNTIF(D105, {\"*_*\"})","v":0},"","","",""]
[null,null,null,null,null,null,null,null,null,null,null,null,null,null,null,null,null,null,null,null,null,null,null,{"$f":"COUNTIF(P106, {\"*/*\"})","v":0},{"$f":"COUNTIF(P106, {\"*-*\"})","v":0},0,0,0,0,0,{"$f":"COUNTIF($S106, {\"*-*\"})","v":0},0,{"$f":"COUNTIF($T106, {\"*-*\"})","v":0},{"$f":"COUNTIF(D106, {\"*-*\"})-COUNTIF(D106, {\"-*\"})","v":0},{"$f":"COUNTIF(D106, {\"*_*\"})","v":0},"","","",""]
[null,null,null,null,null,null,null,null,null,null,null,null,null,null,null,null,null,null,null,null,null,null,null,{"$f":"COUNTIF(P107, {\"*/*\"})","v":0},{"$f":"COUNTIF(P107, {\"*-*\"})","v":0},0,0,0,0,0,{"$f":"COUNTIF($S107, {\"*-*\"})","v":0},0,{"$f":"COUNTIF($T107, {\"*-*\"})","v":0},{"$f":"COUNTIF(D107, {\"*-*\"})-COUNTIF(D107, {\"-*\"})","v":0},{"$f":"COUNTIF(D107, {\"*_*\"})","v":0},"","","",""]
[null,null,null,null,null,null,null,null,null,null,null,null,null,null,null,null,null,null,null,null,null,null,null,{"$f":"COUNTIF(P108, {\"*/*\"})","v":0},{"$f":"COUNTIF(P108, {\"*-*\"})","v":0},0,0,0,0,0,{"$f":"COUNTIF($S108, {\"*-*\"})","v":0},0,{"$f":"COUNTIF($T108, {\"*-*\"})","v":0},{"$f":"COUNTIF(D108, {\"*-*\"})-COUNTIF(D108, {\"-*\"})","v":0},{"$f":"COUNTIF(D108, {\"*_*\"})","v":0},"","","",""]
[null,null,null,null,null,null,null,null,null,null,null,null,null,null,null,null,null,null,null,null,null,null,null,{"$f":"COUNTIF(P109, {\"*/*\"})","v":0},{"$f":"COUNTIF(P109, {\"*-*\"})","v":0},0,0,0,0,0,{"$f":"COUNTIF($S109, {\"*-*\"})","v":0},0,{"$f":"COUNTIF($T109, {\"*-*\"})","v":0},{"$f":"COUNTIF(D109, {\"*-*\"})-COUNTIF(D109, {\"-*\"})","v":0},{"$f":"COUNTIF(D109, {\"*_*\"})","v":0},"","","",""]
[null,null,null,null,null,null,null,null,null,null,null,null,null,null,null,null,null,null,null,null,null,null,null,{"$f":"COUNTIF(P110, {\"*/*\"})","v":0},{"$f":"COUNTIF(P110, {\"*-*\"})","v":0},{"$f":"IF((S110>2359),1,0)","v":0},{"$f":"IF(IF(S110=\"\",0,VALUE(RIGHT(S110,2)))>=60,1,0)","v":0},{"$f":"IF((T110>2359),1,0)","v":0},{"$f":"IF(IF(T110=\"\",0,VALUE(RIGHT(T110,2)))>=60,1,0)","v":0},{"$f":"IF(S110=\"\",0,IF(ISNUMBER(S110)=TRUE,0,1))","v":0},{"$f":"COUNTIF($S110, {\"*-*\"})","v":0},{"$f":"IF(T110=\"\",0,IF(ISNUMBER(T110)=TRUE,0,1))","v":0},{"$f":"COUNTIF($T110, {\"*-*\"})","v":0},{"$f":"COUNTIF(D110, {\"*-*\"})-COUNTIF(D110, {\"-*\"})","v":0},{"$f":"COUNTIF(D110, {\"*_*\"})","v":0},{"$f":"IF(S110=\"\",\"\",HOUR(S110))","v":""},{"$f":"IF(S110=\"\",\"\",MINUTE(S110))","v":""},{"$f":"IF(T110=\"\",\"\",HOUR(T110))","v":""},{"$f":"IF(T110=\"\",\"\",MINUTE(T110))","v":""}]
[null,null,null,null,null,null,null,null,null,null,null,null,null,null,null,null,null,null,null,null,null,null,null,{"$f":"COUNTIF(P111, {\"*/*\"})","v":0},{"$f":"COUNTIF(P111, {\"*-*\"})","v":0},0,0,0,0,0,{"$f":"COUNTIF($S111, {\"*-*\"})","v":0},0,{"$f":"COUNTIF($T111, {\"*-*\"})","v":0},{"$f":"COUNTIF(D111, {\"*-*\"})-COUNTIF(D111, {\"-*\"})","v":0},{"$f":"COUNTIF(D111, {\"*_*\"})","v":0},"","","",""]
[null,null,null,null,null,null,null,null,null,null,null,null,null,null,null,null,null,null,null,null,null,null,null,{"$f":"COUNTIF(P112, {\"*/*\"})","v":0},{"$f":"COUNTIF(P112, {\"*-*\"})","v":0},0,0,0,0,0,{"$f":"COUNTIF($S112, {\"*-*\"})","v":0},0,{"$f":"COUNTIF($T112, {\"*-*\"})","v":0},{"$f":"COUNTIF(D112, {\"*-*\"})-COUNTIF(D112, {\"-*\"})","v":0},{"$f":"COUNTIF(D112, {\"*_*\"})","v":0},"","","",""]
[null,null,null,null,null,null,null,null,null,null,null,null,null,null,null,null,null,null,null,null,null,null,null,{"$f":"COUNTIF(P113, {\"*/*\"})","v":0},{"$f":"COUNTIF(P113, {\"*-*\"})","v":0},0,0,0,0,0,{"$f":"COUNTIF($S113, {\"*-*\"})","v":0},0,{"$f":"COUNTIF($T113, {\"*-*\"})","v":0},{"$f":"COUNTIF(D113, {\"*-*\"})-COUNTIF(D113, {\"-*\"})","v":0},{"$f":"COUNTIF(D113, {\"*_*\"})","v":0},"","","",""]
[null,null,null,null,null,null,null,null,null,null,null,null,null,null,null,null,null,null,null,null,null,null,null,{"$f":"COUNTIF(P114, {\"*/*\"})","v":0},{"$f":"COUNTIF(P114, {\"*-*\"})","v":0},0,0,0,0,0,{"$f":"COUNTIF($S114, {\"*-*\"})","v":0},0,{"$f":"COUNTIF($T114, {\"*-*\"})","v":0},{"$f":"COUNTIF(D114, {\"*-*\"})-COUNTIF(D114, {\"-*\"})","v":0},{"$f":"COUNTIF(D114, {\"*_*\"})","v":0},"","","",""]
[null,null,null,null,null,null,null,null,null,null,null,null,null,null,null,null,null,null,null,null,null,null,null,{"$f":"COUNTIF(P115, {\"*/*\"})","v":0},{"$f":"COUNTIF(P115, {\"*-*\"})","v":0},0,0,0,0,0,{"$f":"COUNTIF($S115, {\"*-*\"})","v":0},0,{"$f":"COUNTIF($T115, {\"*-*\"})","v":0},{"$f":"COUNTIF(D115, {\"*-*\"})-COUNTIF(D115, {\"-*\"})","v":0},{"$f":"COUNTIF(D115, {\"*_*\"})","v":0},"","","",""]
[null,null,null,null,null,null,null,null,null,null,null,null,null,null,null,null,null,null,null,null,null,null,null,{"$f":"COUNTIF(P116, {\"*/*\"})","v":0},{"$f":"COUNTIF(P116, {\"*-*\"})","v":0},0,0,0,0,0,{"$f":"COUNTIF($S116, {\"*-*\"})","v":0},0,{"$f":"COUNTIF($T116, {\"*-*\"})","v":0},{"$f":"COUNTIF(D116, {\"*-*\"})-COUNTIF(D116, {\"-*\"})","v":0},{"$f":"COUNTIF(D116, {\"*_*\"})","v":0},"","","",""]
[null,null,null,null,null,null,null,null,null,null,null,null,null,null,null,null,null,null,null,null,null,null,null,{"$f":"COUNTIF(P117, {\"*/*\"})","v":0},{"$f":"COUNTIF(P117, {\"*-*\"})","v":0},0,0,0,0,0,{"$f":"COUNTIF($S117, {\"*-*\"})","v":0},0,{"$f":"COUNTIF($T117, {\"*-*\"})","v":0},{"$f":"COUNTIF(D117, {\"*-*\"})-COUNTIF(D117, {\"-*\"})","v":0},{"$f":"COUNTIF(D117, {\"*_*\"})","v":0},"","","",""]
[null,null,null,null,null,null,null,null,null,null,null,null,null,null,null,null,null,null,null,null,null,null,null,{"$f":"COUNTIF(P118, {\"*/*\"})","v":0},{"$f":"COUNTIF(P118, {\"*-*\"})","v":0},0,0,0,0,0,{"$f":"COUNTIF($S118, {\"*-*\"})","v":0},0,{"$f":"COUNTIF($T118, {\"*-*\"})","v":0},{"$f":"COUNTIF(D118, {\"*-*\"})-COUNTIF(D118, {\"-*\"})","v":0},{"$f":"COUNTIF(D118, {\"*_*\"})","v":0},"","","",""]
[null,null,null,null,null,null,null,null,null,null,null,null,null,null,null,null,null,null,null,null,null,null,null,{"$f":"COUNTIF(P119, {\"*/*\"})","v":0},{"$f":"COUNTIF(P119, {\"*-*\"})","v":0},0,0,0,0,0,{"$f":"COUNTIF($S119, {\"*-*\"})","v":0},0,{"$f":"COUNTIF($T119, {\"*-*\"})","v":0},{"$f":"COUNTIF(D119, {\"*-*\"})-COUNTIF(D119, {\"-*\"})","v":0},{"$f":"COUNTIF(D119, {\"*_*\"})","v":0},"","","",""]
[null,null,null,null,null,null,null,null,null,null,null,null,null,null,null,null,null,null,null,null,null,null,null,{"$f":"COUNTIF(P120, {\"*/*\"})","v":0},{"$f":"COUNTIF(P120, {\"*-*\"})","v":0},0,0,0,0,0,{"$f":"COUNTIF($S120, {\"*-*\"})","v":0},0,{"$f":"COUNTIF($T120, {\"*-*\"})","v":0},{"$f":"COUNTIF(D120, {\"*-*\"})-COUNTIF(D120, {\"-*\"})","v":0},{"$f":"COUNTIF(D120, {\"*_*\"})","v":0},"","","",""]
[null,null,null,null,null,null,null,null,null,null,null,null,null,null,null,null,null,null,null,null,null,null,null,{"$f":"COUNTIF(P121, {\"*/*\"})","v":0},{"$f":"COUNTIF(P121, {\"*-*\"})","v":0},0,0,0,0,0,{"$f":"COUNTIF($S121, {\"*-*\"})","v":0},0,{"$f":"COUNTIF($T121, {\"*-*\"})","v":0},{"$f":"COUNTIF(D121, {\"*-*\"})-COUNTIF(D121, {\"-*\"})","v":0},{"$f":"COUNTIF(D121, {\"*_*\"})","v":0},"","","",""]
[null,null,null,null,null,null,null,null,null,null,null,null,null,null,null,null,null,null,null,null,null,null,null,{"$f":"COUNTIF(P122, {\"*/*\"})","v":0},{"$f":"COUNTIF(P122, {\"*-*\"})","v":0},0,0,0,0,0,{"$f":"COUNTIF($S122, {\"*-*\"})","v":0},0,{"$f":"COUNTIF($T122, {\"*-*\"})","v":0},{"$f":"COUNTIF(D122, {\"*-*\"})-COUNTIF(D122, {\"-*\"})","v":0},{"$f":"COUNTIF(D122, {\"*_*\"})","v":0},"","","",""]
[null,null,null,null,null,null,null,null,null,null,null,null,null,null,null,null,null,null,null,null,null,null,null,{"$f":"COUNTIF(P123, {\"*/*\"})","v":0},{"$f":"COUNTIF(P123, {\"*-*\"})","v":0},0,0,0,0,0,{"$f":"COUNTIF($S123, {\"*-*\"})","v":0},0,{"$f":"COUNTIF($T123, {\"*-*\"})","v":0},{"$f":"COUNTIF(D123, {\"*-*\"})-COUNTIF(D123, {\"-*\"})","v":0},{"$f":"COUNTIF(D123, {\"*_*\"})","v":0},"","","",""]
[null,null,null,null,null,null,null,null,null,null,null,null,null,null,null,null,null,null,null,null,null,null,null,{"$f":"COUNTIF(P124, {\"*/*\"})","v":0},{"$f":"COUNTIF(P124, {\"*-*\"})","v":0},0,0,0,0,0,{"$f":"COUNTIF($S124, {\"*-*\"})","v":0},0,{"$f":"COUNTIF($T124, {\"*-*\"})","v":0},{"$f":"COUNTIF(D124, {\"*-*\"})-COUNTIF(D124, {\"-*\"})","v":0},{"$f":"COUNTIF(D124, {\"*_*\"})","v":0},"","","",""]
[null,null,null,null,null,null,null,null,null,null,null,null,null,null,null,null,null,null,null,null,null,null,null,{"$f":"COUNTIF(P125, {\"*/*\"})","v":0},{"$f":"COUNTIF(P125, {\"*-*\"})","v":0},0,0,0,0,0,{"$f":"COUNTIF($S125, {\"*-*\"})","v":0},0,{"$f":"COUNTIF($T125, {\"*-*\"})","v":0},{"$f":"COUNTIF(D125, {\"*-*\"})-COUNTIF(D125, {\"-*\"})","v":0},{"$f":"COUNTIF(D125, {\"*_*\"})","v":0},"","","",""]
[null,null,null,null,null,null,null,null,null,null,null,null,null,null,null,null,null,null,null,null,null,null,null,{"$f":"COUNTIF(P126, {\"*/*\"})","v":0},{"$f":"COUNTIF(P126, {\"*-*\"})","v":0},0,0,0,0,0,{"$f":"COUNTIF($S126, {\"*-*\"})","v":0},0,{"$f":"COUNTIF($T126, {\"*-*\"})","v":0},{"$f":"COUNTIF(D126, {\"*-*\"})-COUNTIF(D126, {\"-*\"})","v":0},{"$f":"COUNTIF(D126, {\"*_*\"})","v":0},"","","",""]
[null,null,null,null,null,null,null,null,null,null,null,null,null,null,null,null,null,null,null,null,null,null,null,{"$f":"COUNTIF(P127, {\"*/*\"})","v":0},{"$f":"COUNTIF(P127, {\"*-*\"})","v":0},0,0,0,0,0,{"$f":"COUNTIF($S127, {\"*-*\"})","v":0},0,{"$f":"COUNTIF($T127, {\"*-*\"})","v":0},{"$f":"COUNTIF(D127, {\"*-*\"})-COUNTIF(D127, {\"-*\"})","v":0},{"$f":"COUNTIF(D127, {\"*_*\"})","v":0},"","","",""]
[null,null,null,null,null,null,null,null,null,null,null,null,null,null,null,null,null,null,null,null,null,null,null,{"$f":"COUNTIF(P128, {\"*/*\"})","v":0},{"$f":"COUNTIF(P128, {\"*-*\"})","v":0},0,0,0,0,0,{"$f":"COUNTIF($S128, {\"*-*\"})","v":0},0,{"$f":"COUNTIF($T128, {\"*-*\"})","v":0},{"$f":"COUNTIF(D128, {\"*-*\"})-COUNTIF(D128, {\"-*\"})","v":0},{"$f":"COUNTIF(D128, {\"*_*\"})","v":0},"","","",""]
[null,null,null,null,null,null,null,null,null,null,null,null,null,null,null,null,null,null,null,null,null,null,null,{"$f":"COUNTIF(P129, {\"*/*\"})","v":0},{"$f":"COUNTIF(P129, {\"*-*\"})","v":0},0,0,0,0,0,{"$f":"COUNTIF($S129, {\"*-*\"})","v":0},0,{"$f":"COUNTIF($T129, {\"*-*\"})","v":0},{"$f":"COUNTIF(D129, {\"*-*\"})-COUNTIF(D129, {\"-*\"})","v":0},{"$f":"COUNTIF(D129, {\"*_*\"})","v":0},"","","",""]
[null,null,null,null,null,null,null,null,null,null,null,null,null,null,null,null,null,null,null,null,null,null,null,{"$f":"COUNTIF(P130, {\"*/*\"})","v":0},{"$f":"COUNTIF(P130, {\"*-*\"})","v":0},0,0,0,0,0,{"$f":"COUNTIF($S130, {\"*-*\"})","v":0},0,{"$f":"COUNTIF($T130, {\"*-*\"})","v":0},{"$f":"COUNTIF(D130, {\"*-*\"})-COUNTIF(D130, {\"-*\"})","v":0},{"$f":"COUNTIF(D130, {\"*_*\"})","v":0},"","","",""]
[null,null,null,null,null,null,null,null,null,null,null,null,null,null,null,null,null,null,null,null,null,null,null,{"$f":"COUNTIF(P131, {\"*/*\"})","v":0},{"$f":"COUNTIF(P131, {\"*-*\"})","v":0},0,0,0,0,0,{"$f":"COUNTIF($S131, {\"*-*\"})","v":0},0,{"$f":"COUNTIF($T131, {\"*-*\"})","v":0},{"$f":"COUNTIF(D131, {\"*-*\"})-COUNTIF(D131, {\"-*\"})","v":0},{"$f":"COUNTIF(D131, {\"*_*\"})","v":0},"","","",""]
[null,null,null,null,null,null,null,null,null,null,null,null,null,null,null,null,null,null,null,null,null,null,null,{"$f":"COUNTIF(P132, {\"*/*\"})","v":0},{"$f":"COUNTIF(P132, {\"*-*\"})","v":0},0,0,0,0,0,{"$f":"COUNTIF($S132, {\"*-*\"})","v":0},0,{"$f":"COUNTIF($T132, {\"*-*\"})","v":0},{"$f":"COUNTIF(D132, {\"*-*\"})-COUNTIF(D132, {\"-*\"})","v":0},{"$f":"COUNTIF(D132, {\"*_*\"})","v":0},"","","",""]
[null,null,null,null,null,null,null,null,null,null,null,null,null,null,null,null,null,null,null,null,null,null,null,{"$f":"COUNTIF(P133, {\"*/*\"})","v":0},{"$f":"COUNTIF(P133, {\"*-*\"})","v":0},0,0,0,0,0,{"$f":"COUNTIF($S133, {\"*-*\"})","v":0},0,{"$f":"COUNTIF($T133, {\"*-*\"})","v":0},{"$f":"COUNTIF(D133, {\"*-*\"})-COUNTIF(D133, {\"-*\"})","v":0},{"$f":"COUNTIF(D133, {\"*_*\"})","v":0},"","","",""]
[null,null,null,null,null,null,null,null,null,null,null,null,null,null,null,null,null,null,null,null,null,null,null,{"$f":"COUNTIF(P134, {\"*/*\"})","v":0},{"$f":"COUNTIF(P134, {\"*-*\"})","v":0},0,0,0,0,0,{"$f":"COUNTIF($S134, {\"*-*\"})","v":0},0,{"$f":"COUNTIF($T134, {\"*-*\"})","v":0},{"$f":"COUNTIF(D134, {\"*-*\"})-COUNTIF(D134, {\"-*\"})","v":0},{"$f":"COUNTIF(D134, {\"*_*\"})","v":0},"","","",""]
[null,null,null,null,null,null,null,null,null,null,null,null,null,null,null,null,null,null,null,null,null,null,null,{"$f":"COUNTIF(P135, {\"*/*\"})","v":0},{"$f":"COUNTIF(P135, {\"*-*\"})","v":0},0,0,0,0,0,{"$f":"COUNTIF($S135, {\"*-*\"})","v":0},0,{"$f":"COUNTIF($T135, {\"*-*\"})","v":0},{"$f":"COUNTIF(D135, {\"*-*\"})-COUNTIF(D135, {\"-*\"})","v":0},{"$f":"COUNTIF(D135, {\"*_*\"})","v":0},"","","",""]
[null,null,null,null,null,null,null,null,null,null,null,null,null,null,null,null,null,null,null,null,null,null,null,{"$f":"COUNTIF(P136, {\"*/*\"})","v":0},{"$f":"COUNTIF(P136, {\"*-*\"})","v":0},0,0,0,0,0,{"$f":"COUNTIF($S136, {\"*-*\"})","v":0},0,{"$f":"COUNTIF($T136, {\"*-*\"})","v":0},{"$f":"COUNTIF(D136, {\"*-*\"})-COUNTIF(D136, {\"-*\"})","v":0},{"$f":"COUNTIF(D136, {\"*_*\"})","v":0},"","","",""]
[null,null,null,null,null,null,null,null,null,null,null,null,null,null,null,null,null,null,null,null,null,null,null,{"$f":"COUNTIF(P137, {\"*/*\"})","v":0},{"$f":"COUNTIF(P137, {\"*-*\"})","v":0},0,0,0,0,0,{"$f":"COUNTIF($S137, {\"*-*\"})","v":0},0,{"$f":"COUNTIF($T137, {\"*-*\"})","v":0},{"$f":"COUNTIF(D137, {\"*-*\"})-COUNTIF(D137, {\"-*\"})","v":0},{"$f":"COUNTIF(D137, {\"*_*\"})","v":0},"","","",""]
[null,null,null,null,null,null,null,null,null,null,null,null,null,null,null,null,null,null,null,null,null,null,null,{"$f":"COUNTIF(P138, {\"*/*\"})","v":0},{"$f":"COUNTIF(P138, {\"*-*\"})","v":0},0,0,0,0,0,{"$f":"COUNTIF($S138, {\"*-*\"})","v":0},0,{"$f":"COUNTIF($T138, {\"*-*\"})","v":0},{"$f":"COUNTIF(D138, {\"*-*\"})-COUNTIF(D138, {\"-*\"})","v":0},{"$f":"COUNTIF(D138, {\"*_*\"})","v":0},"","","",""]
[null,null,null,null,null,null,null,null,null,null,null,null,null,null,null,null,null,null,null,null,null,null,null,{"$f":"COUNTIF(P139, {\"*/*\"})","v":0},{"$f":"COUNTIF(P139, {\"*-*\"})","v":0},0,0,0,0,0,{"$f":"COUNTIF($S139, {\"*-*\"})","v":0},0,{"$f":"COUNTIF($T139, {\"*-*\"})","v":0},{"$f":"COUNTIF(D139, {\"*-*\"})-COUNTIF(D139, {\"-*\"})","v":0},{"$f":"COUNTIF(D139, {\"*_*\"})","v":0},"","","",""]
[null,null,null,null,null,null,null,null,null,null,null,null,null,null,null,null,null,null,null,null,null,null,null,{"$f":"COUNTIF(P140, {\"*/*\"})","v":0},{"$f":"COUNTIF(P140, {\"*-*\"})","v":0},0,0,0,0,0,{"$f":"COUNTIF($S140, {\"*-*\"})","v":0},0,{"$f":"COUNTIF($T140, {\"*-*\"})","v":0},{"$f":"COUNTIF(D140, {\"*-*\"})-COUNTIF(D140, {\"-*\"})","v":0},{"$f":"COUNTIF(D140, {\"*_*\"})","v":0},"","","",""]
[null,null,null,null,null,null,null,null,null,null,null,null,null,null,null,null,null,null,null,null,null,null,null,{"$f":"COUNTIF(P141, {\"*/*\"})","v":0},{"$f":"COUNTIF(P141, {\"*-*\"})","v":0},0,0,0,0,0,{"$f":"COUNTIF($S141, {\"*-*\"})","v":0},0,{"$f":"COUNTIF($T141, {\"*-*\"})","v":0},{"$f":"COUNTIF(D141, {\"*-*\"})-COUNTIF(D141, {\"-*\"})","v":0},{"$f":"COUNTIF(D141, {\"*_*\"})","v":0},"","","",""]
[null,null,null,null,null,null,null,null,null,null,null,null,null,null,null,null,null,null,null,null,null,null,null,{"$f":"COUNTIF(P142, {\"*/*\"})","v":0},{"$f":"COUNTIF(P142, {\"*-*\"})","v":0},0,0,0,0,0,{"$f":"COUNTIF($S142, {\"*-*\"})","v":0},0,{"$f":"COUNTIF($T142, {\"*-*\"})","v":0},{"$f":"COUNTIF(D142, {\"*-*\"})-COUNTIF(D142, {\"-*\"})","v":0},{"$f":"COUNTIF(D142, {\"*_*\"})","v":0},"","","",""]
[null,null,null,null,null,null,null,null,null,null,null,null,null,null,null,null,null,null,null,null,null,null,null,{"$f":"COUNTIF(P143, {\"*/*\"})","v":0},{"$f":"COUNTIF(P143, {\"*-*\"})","v":0},0,0,0,0,0,{"$f":"COUNTIF($S143, {\"*-*\"})","v":0},0,{"$f":"COUNTIF($T143, {\"*-*\"})","v":0},{"$f":"COUNTIF(D143, {\"*-*\"})-COUNTIF(D143, {\"-*\"})","v":0},{"$f":"COUNTIF(D143, {\"*_*\"})","v":0},"","","",""]
[null,null,null,null,null,null,null,null,null,null,null,null,null,null,null,null,null,null,null,null,null,null,null,{"$f":"COUNTIF(P144, {\"*/*\"})","v":0},{"$f":"COUNTIF(P144, {\"*-*\"})","v":0},0,0,0,0,0,{"$f":"COUNTIF($S144, {\"*-*\"})","v":0},0,{"$f":"COUNTIF($T144, {\"*-*\"})","v":0},{"$f":"COUNTIF(D144, {\"*-*\"})-COUNTIF(D144, {\"-*\"})","v":0},{"$f":"COUNTIF(D144, {\"*_*\"})","v":0},"","","",""]
["ALS afrapporterer max. 100 prøver pr. sag. Såfremt der fremsendes flere end 100 prøver samtidigt, udfyldes flere rekvisitioner."]

{"sheet":"6. Luft-Orsarør","index":5,"n_rows":145,"n_cols":39,"rows_kept":145,"cut":false,"hidden":false,"merged":[[32,35,43,35],[32,36,43,36],[32,37,43,37],[32,38,43,38],[30,0,42,2],[11,2,11,6],[10,2,10,6],[43,0,43,2],[32,32,43,32],[32,33,43,33],[32,34,43,34],[32,26,43,26],[32,27,43,27],[32,28,43,28],[32,29,43,29],[32,30,43,30],[32,31,43,31],[22,10,22,18],[29,15,29,20],[30,3,43,3],[31,19,43,20],[31,6,43,6],[30,6,30,10],[43,4,43,5],[4,12,4,14],[4,15,4,19],[4,2,4,11],[22,5,22,9],[1,0,2,20],[7,15,7,17],[19,10,19,18],[20,10,20,18],[14,10,14,18],[21,10,21,18],[18,2,18,7],[18,10,18,18],[19,2,19,7],[14,2,14,7],[8,2,8,6],[9,2,9,6],[20,5,20,9],[21,5,21,9],[3,2,3,6],[3,12,3,19],[7,2,7,6],[139,16,139,18],[138,19,138,20],[139,19,139,20],[136,19,136,20],[137,19,137,20],[136,4,136,5],[137,4,137,5],[136,0,136,2],[137,0,137,2],[138,0,138,2],[139,0,139,2],[133,0,133,2],[134,0,134,2],[135,0,135,2],[143,19,143,20],[143,4,143,5],[143,16,143,18],[140,19,140,20],[141,19,141,20],[140,4,140,5],[141,4,141,5],[142,4,142,5],[140,16,140,18],[141,16,141,18],[142,16,142,18],[142,19,142,20],[140,0,140,2],[141,0,141,2],[142,0,142,2],[143,0,143,2],[138,4,138,5],[139,4,139,5],[136,16,136,18],[137,16,137,18],[138,16,138,18],[134,4,134,5],[135,4,135,5],[132,16,132,18],[133,16,133,18],[134,16,134,18],[135,16,135,18],[134,19,134,20],[135,19,135,20],[132,19,132,20],[133,19,133,20],[132,4,132,5],[133,4,133,5],[130,4,130,5],[131,4,131,5],[128,16,128,18],[129,16,129,18],[130,16,130,18],[131,16,131,18],[130,19,130,20],[131,19,131,20],[128,19,128,20],[129,19,129,20],[128,4,128,5],[129,4,129,5],[124,16,124,18],[126,16,126,18],[127,16,127,18],[122,19,122,20],[123,19,123,20],[120,19,120,20],[121,19,121,20],[123,4,123,5],[126,19,126,20],[127,19,127,20],[126,4,126,5],[127,4,127,5],[121,16,121,18],[122,16,122,18],[125,16,125,18],[125,19,125,20],[124,4,124,5],[125,4,125,5],[123,16,123,18],[124,19,124,20],[119,19,119,20],[120,4,120,5],[121,4,121,5],[122,4,122,5],[119,16,119,18],[119,4,119,5],[115,16,115,18],[116,16,116,18],[117,16,117,18],[118,16,118,18],[117,19,117,20],[118,19,118,20],[115,19,115,20],[116,19,116,20],[115,4,115,5],[116,4,116,5],[117,4,117,5],[118,4,118,5],[120,16,120,18],[110,16,110,18],[109,19,109,20],[110,19,110,20],[107,19,107,20],[108,19,108,20],[107,4,107,5],[108,4,108,5],[113,4,113,5],[114,4,114,5],[111,16,111,18],[112,16,112,18],[113,16,113,18],[114,16,114,18],[109,4,109,5],[110,4,110,5],[113,19,113,20],[114,19,114,20],[111,19,111,20],[112,19,112,20],[111,4,111,5],[112,4,112,5],[105,19,105,20],[106,19,106,20],[103,19,103,20],[104,19,104,20],[103,4,103,5],[104,4,104,5],[107,16,107,18],[108,16,108,18],[109,16,109,18],[100,4,100,5],[101,4,101,5],[102,4,102,5],[99,16,99,18],[105,4,105,5],[106,4,106,5],[103,16,103,18],[104,16,104,18],[105,16,105,18],[106,16,106,18],[99,4,99,5],[100,16,100,18],[101,16,101,18],[102,16,102,18],[93,16,93,18],[94,19,94,20],[97,16,97,18],[98,16,98,18],[94,4,94,5],[95,4,95,5],[96,4,96,5],[97,19,97,20],[98,19,98,20],[95,19,95,20],[96,19,96,20],[97,4,97,5],[98,4,98,5],[94,16,94,18],[95,16,95,18],[96,16,96,18],[101,19,101,20],[102,19,102,20],[99,19,99,20],[100,19,100,20],[90,4,90,5],[91,4,91,5],[92,4,92,5],[93,4,93,5],[87,19,87,20],[88,19,88,20],[87,4,87,5],[87,16,87,18],[88,16,88,18],[89,16,89,18],[88,4,88,5],[89,4,89,5],[89,19,89,20],[91,19,91,20],[92,19,92,20],[90,19,90,20],[93,19,93,20],[90,16,90,18],[91,16,91,18],[92,16,92,18],[84,19,84,20],[85,19,85,20],[82,19,82,20],[83,19,83,20],[82,4,82,5],[83,4,83,5],[82,0,82,2],[83,0,83,2],[84,0,84,2],[85,0,85,2],[84,4,84,5],[85,4,85,5],[82,16,82,18],[83,16,83,18],[84,16,84,18],[85,16,85,18],[80,19,80,20],[81,19,81,20],[78,19,78,20],[79,19,79,20],[78,4,78,5],[79,4,79,5],[76,19,76,20],[77,19,77,20],[74,19,74,20],[75,19,75,20],[74,4,74,5],[75,4,75,5],[74,16,74,18],[75,16,75,18],[76,16,76,18],[77,16,77,18],[80,4,80,5],[81,4,81,5],[78,16,78,18],[79,16,79,18],[80,16,80,18],[81,16,81,18],[76,4,76,5],[77,4,77,5],[71,16,71,18],[72,16,72,18],[73,16,73,18],[72,19,72,20],[73,19,73,20],[70,19,70,20],[71,19,71,20],[70,4,70,5],[71,4,71,5],[72,4,72,5],[73,4,73,5],[69,19,69,20],[66,19,66,20],[68,16,68,18],[69,16,69,18],[67,19,67,20],[66,16,66,18],[67,16,67,18],[68,19,68,20],[31,10,43,10],[31,11,43,11],[31,12,43,12],[60,19,60,20],[58,19,58,20],[57,19,57,20],[59,19,59,20],[47,19,47,20],[48,19,48,20],[62,19,62,20],[63,16,63,18],[54,16,54,18],[53,19,53,20],[48,16,48,18],[49,16,49,18],[50,16,50,18],[51,16,51,18],[31,16,43,18],[46,19,46,20],[44,16,44,18],[45,16,45,18],[46,16,46,18],[49,19,49,20],[50,19,50,20],[30,4,42,5],[44,19,44,20],[45,19,45,20],[31,13,43,13],[31,14,43,14],[31,15,43,15],[31,7,43,7],[31,8,43,8],[47,16,47,18],[31,9,43,9],[45,4,45,5],[46,4,46,5],[47,4,47,5],[48,4,48,5],[49,4,49,5],[50,4,50,5],[86,4,86,5],[15,2,15,7],[15,10,15,18],[16,2,16,7],[16,10,16,18],[17,2,17,7],[17,10,17,18],[55,16,55,18],[56,16,56,18],[61,16,61,18],[62,4,62,5],[61,4,61,5],[30,15,30,20],[30,11,30,14],[24,0,24,20],[25,0,28,20],[29,0,29,5],[44,4,44,5],[51,19,51,20],[55,19,55,20],[54,4,54,5],[55,4,55,5],[56,4,56,5],[57,4,57,5],[64,19,64,20],[65,19,65,20],[61,19,61,20],[52,16,52,18],[56,19,56,20],[53,16,53,18],[63,4,63,5],[64,4,64,5],[65,4,65,5],[62,16,62,18],[54,19,54,20],[57,16,57,18],[58,16,58,18],[59,16,59,18],[60,16,60,18],[64,16,64,18],[65,16,65,18],[63,19,63,20],[52,19,52,20],[60,4,60,5],[58,4,58,5],[59,4,59,5],[53,4,53,5],[52,4,52,5],[144,0,145,20],[86,16,86,18],[86,19,86,20],[62,0,62,2],[63,0,63,2],[64,0,64,2],[65,0,65,2],[66,0,66,2],[67,0,67,2],[68,0,68,2],[69,0,69,2],[70,0,70,2],[86,0,86,2],[87,0,87,2],[88,0,88,2],[89,0,89,2],[68,4,68,5],[69,4,69,5],[66,4,66,5],[67,4,67,5],[70,16,70,18],[99,0,99,2],[100,0,100,2],[101,0,101,2],[44,0,44,2],[45,0,45,2],[46,0,46,2],[47,0,47,2],[48,0,48,2],[49,0,49,2],[50,0,50,2],[51,0,51,2],[52,0,52,2],[74,0,74,2],[75,0,75,2],[76,0,76,2],[96,0,96,2],[97,0,97,2],[98,0,98,2],[90,0,90,2],[91,0,91,2],[92,0,92,2],[93,0,93,2],[94,0,94,2],[77,0,77,2],[117,0,117,2],[108,0,108,2],[109,0,109,2],[110,0,110,2],[111,0,111,2],[112,0,112,2],[113,0,113,2],[114,0,114,2],[102,0,102,2],[103,0,103,2],[104,0,104,2],[105,0,105,2],[106,0,106,2],[107,0,107,2],[115,0,115,2],[116,0,116,2],[61,0,61,2],[53,0,53,2],[54,0,54,2],[55,0,55,2],[56,0,56,2],[57,0,57,2],[58,0,58,2],[59,0,59,2],[60,0,60,2],[51,4,51,5],[71,0,71,2],[72,0,72,2],[73,0,73,2],[127,0,127,2],[128,0,128,2],[129,0,129,2],[130,0,130,2],[132,0,132,2],[118,0,118,2],[119,0,119,2],[120,0,120,2],[121,0,121,2],[122,0,122,2],[123,0,123,2],[124,0,124,2],[125,0,125,2],[126,0,126,2],[131,0,131,2],[78,0,78,2],[79,0,79,2],[80,0,80,2],[81,0,81,2],[95,0,95,2]]}
[]
["Analyserekvisition LUFT, ORSARØR"]
[]
["Sagsnr.:",null,{"$f":"IF('1. Stamdata'!D22=\"\",\"\",'1. Stamdata'!D22)","v":""},null,null,null,null,"Lokalitetsnr.:",null,null,null,null,{"$f":"IF('1. Stamdata'!N22=\"\",\"\",'1. Stamdata'!N22)","v":""}]
["Lokalitetsnavn:",null,{"$f":"IF('1. Stamdata'!D23=\"\",\"\",'1. Stamdata'!D23)","v":""},null,null,null,null,null,null,null,null,null,"Region:",null,null,{"$f":"IF('1. Stamdata'!Q23=\"\",\"\",'1. Stamdata'!Q23)","v":""}]
[]
[]
["Prøvetager:",null,null,null,null,null,null,null,null,null,"Leveringstid:"]
["Start dato:",null,null,null,null,null,null,null,null,null,"Normal:"]
["Slut dato:",null,null,null,null,null,null,null,null,null,"Dag-til-dag"]
["Indleveringsdato:",null,null,null,null,null,null,null,null,null,"Dag-til-dag (P12):"]
["Rekvisitionsdato:",null,null,null,null,null,null,null,null,null,"Dag-til-dag (P9):"]
[]
[null,null,"Rapportmodtager:",null,null,null,null,null,null,null,"Fakturamodtager:"]
[{"$f":"'1. Stamdata'!$B$26","v":"Firma:"},null,{"$f":"IF('1. Stamdata'!D26=\"\",\"\",'1. Stamdata'!D26)","v":""},null,null,null,null,null,null,null,{"$f":"IF('1. Stamdata'!M26=\"\",\"\",'1. Stamdata'!M26)","v":""}]
[{"$f":"'1. Stamdata'!$B$27","v":"Adresse:"},null,{"$f":"IF('1. Stamdata'!D27=\"\",\"\",'1. Stamdata'!D27)","v":""},null,null,null,null,null,null,null,{"$f":"IF('1. Stamdata'!M27=\"\",\"\",'1. Stamdata'!M27)","v":""}]
[{"$f":"'1. Stamdata'!$B$28","v":"Postnr./By:"},null,{"$f":"IF('1. Stamdata'!D28=\"\",\"\",'1. Stamdata'!D28)","v":""},null,null,null,null,null,null,null,{"$f":"IF('1. Stamdata'!M28=\"\",\"\",'1. Stamdata'!M28)","v":""}]
[{"$f":"'1. Stamdata'!$B$29","v":"Kontaktperson:"},null,{"$f":"IF('1. Stamdata'!D29=\"\",\"\",'1. Stamdata'!D29)","v":""},null,null,null,null,null,null,null,{"$f":"IF('1. Stamdata'!M29=\"\",\"\",'1. Stamdata'!M29)","v":""}]
[{"$f":"'1. Stamdata'!$B$30","v":"Telefonnummer:"},null,{"$f":"IF('1. Stamdata'!D30=\"\",\"\",'1. Stamdata'!D30)","v":""},null,null,null,null,null,null,null,{"$f":"IF('1. Stamdata'!M30=\"\",\"\",'1. Stamdata'!M30)","v":""}]
[{"$f":"'1. Stamdata'!$B31","v":"E-mail | EAN:"},null,{"$f":"IF('1. Stamdata'!D31=\"\",\"\",'1. Stamdata'!D31)","v":""},null,null,null,null,null,null,null,{"$f":"IF('1. Stamdata'!M31=\"\",\"\",'1. Stamdata'!M31)","v":""}]
[{"$f":"'1. Stamdata'!$B32","v":"Personreference:"},null,{"$f":"IF('1. Stamdata'!D32=\"\",\"\",'1. Stamdata'!D32)","v":""},null,null,null,null,null,null,null,{"$f":"IF('1. Stamdata'!M32=\"\",\"\",'1. Stamdata'!M32)","v":""}]
[{"$f":"'1. Stamdata'!$B33","v":"Fakturareference:"},null,null,null,null,null,null,null,null,null,{"$f":"IF('1. Stamdata'!M33=\"\",\"\",'1. Stamdata'!M33)","v":""}]
[{"$f":"'1. Stamdata'!$B34","v":"Fakturering:"},null,null,null,null,null,null,null,null,null,{"$f":"IF('1. Stamdata'!M34=\"\",\"\",'1. Stamdata'!M34)","v":"Månedlig samlefaktura (A)"}]
[]
["Bemærkninger:"]
[]
[]
[]
[]
["Optælling",null,null,null,null,null,{"$f":"COUNTA(G45:G144)","v":0},{"$f":"COUNTA(H45:H144)","v":0},0,0,0,0,0,0,{"$f":"COUNTA(O45:O144)","v":0},{"$f":"IF(COUNTA(A45:C144)*2=COUNTA(Q45:U144),\"\",\"SKAL UDFYLDES\")","v":""}]
["Rekvisition udfyldes med\nét ORSA-rør pr. linje",null,null,"Dybde m u.t.","Forbeholdt ALS",null,"ORSA-rør",null,null,null,null,"Andet",null,null,null,"Supplerende oplysninger"]
[null,null,null,null,null,null,"Kulbrinter + BTEXN + C9 & C10 (6700)","Chlorerede opløsningsmidler (5832)","Kulb + BTEXN + C9&C10 + chlor.opl. (6701)","Chlorerede nedbrydningsprod (6316)","Chlor.opl+nedbryd.prod, samme rør (5851)",null,null,null,null,"Opsamlingstid i timer (beregnes automatisk)","Start tid (f.eks.kl. 00:00)",null,null,"Slut tid (f.eks. kl. 23:59)"]
[null,null,null,null,null,null,null,null,null,null,null,null,null,null,null,null,null,null,null,null,null,null,null,null,null,null,null,null,null,null,null,null,null,"Dybde \"-\"","Dybde \"_\"","Start tid TT","Start tid MM","Slut tid TT","Slut tid MM"]
[]
[]
[]
[]
[]
[]
[]
[]
[]
[]
["PrøvestedsID",null,null,null,"Labnr.",null,null,null,null,null,null,null,null,null,null,null,null,null,null,null,null,null,null,null,null,null,null,null,null,null,null,null,null,"Dybde\"-\"","Dybde\"_\"",null,"Start tid MM","Slut tid TT","Slut tid MM"]
[null,null,null,null,null,null,null,null,null,null,null,null,null,null,null,{"$f":"IF($C$10=\"\",\"\",IF($C$9=\"\",\"\",IF(Q45=\"\",\"\",IF(T45=\"\",\"\",ROUND(($C$10-$C$9)*24+((T45-Q45)*24),0)))))","v":""},null,null,null,null,null,{"$f":"IF(Q45=\"\",\"\",IF((COUNTA(Q45)*2)<>COUNTA($C$9,$C$10),\"Husk start og slut dato i celle C9 OG C10\",\"\"))","v":""},null,null,null,null,null,null,null,null,null,null,null,{"$f":"COUNTIF(D45, {\"*-*\"})-COUNTIF(D45, {\"-*\"})","v":0},{"$f":"COUNTIF(D45, {\"*_*\"})","v":0},{"$f":"IF(Q45=\"\",\"\",HOUR(Q45))","v":""},{"$f":"IF(Q45=\"\",\"\",MINUTE(Q45))","v":""},{"$f":"IF(T45=\"\",\"\",HOUR(T45))","v":""},{"$f":"IF(T45=\"\",\"\",MINUTE(T45))","v":""}]
[null,null,null,null,null,null,null,null,null,null,null,null,null,null,null,{"$f":"IF($C$10=\"\",\"\",IF($C$9=\"\",\"\",IF(Q46=\"\",\"\",IF(T46=\"\",\"\",ROUND(($C$10-$C$9)*24+((T46-Q46)*24),0)))))","v":""},null,null,null,null,null,{"$f":"IF(Q46=\"\",\"\",IF((COUNTA(Q46)*2)<>COUNTA($C$9,$C$10),\"Husk start og slut dato i C9 OG C10\",\"\"))","v":""},null,null,null,null,null,null,null,null,null,null,null,{"$f":"COUNTIF(D46, {\"*-*\"})-COUNTIF(D46, {\"-*\"})","v":0},{"$f":"COUNTIF(D46, {\"*_*\"})","v":0},{"$f":"IF(Q46=\"\",\"\",HOUR(Q46))","v":""},{"$f":"IF(Q46=\"\",\"\",MINUTE(Q46))","v":""},{"$f":"IF(T46=\"\",\"\",HOUR(T46))","v":""},{"$f":"IF(T46=\"\",\"\",MINUTE(T46))","v":""}]
[null,null,null,null,null,null,null,null,null,null,null,null,null,null,null,"",null,null,null,null,null,"",null,null,null,null,null,null,null,null,null,null,null,{"$f":"COUNTIF(D47, {\"*-*\"})-COUNTIF(D47, {\"-*\"})","v":0},{"$f":"COUNTIF(D47, {\"*_*\"})","v":0},"","","",""]
[null,null,null,null,null,null,null,null,null,null,null,null,null,null,null,"",null,null,null,null,null,"",null,null,null,null,null,null,null,null,null,null,null,{"$f":"COUNTIF(D48, {\"*-*\"})-COUNTIF(D48, {\"-*\"})","v":0},{"$f":"COUNTIF(D48, {\"*_*\"})","v":0},"","","",""]
[null,null,null,null,null,null,null,null,null,null,null,null,null,null,null,"",null,null,null,null,null,"",null,null,null,null,null,null,null,null,null,null,null,{"$f":"COUNTIF(D49, {\"*-*\"})-COUNTIF(D49, {\"-*\"})","v":0},{"$f":"COUNTIF(D49, {\"*_*\"})","v":0},"","","",""]
[null,null,null,null,null,null,null,null,null,null,null,null,null,null,null,"",null,null,null,null,null,"",null,null,null,null,null,null,null,null,null,null,null,{"$f":"COUNTIF(D50, {\"*-*\"})-COUNTIF(D50, {\"-*\"})","v":0},{"$f":"COUNTIF(D50, {\"*_*\"})","v":0},"","","",""]
[null,null,null,null,null,null,null,null,null,null,null,null,null,null,null,"",null,null,null,null,null,"",null,null,null,null,null,null,null,null,null,null,null,{"$f":"COUNTIF(D51, {\"*-*\"})-COUNTIF(D51, {\"-*\"})","v":0},{"$f":"COUNTIF(D51, {\"*_*\"})","v":0},"","","",""]
[null,null,null,null,null,null,null,null,null,null,null,null,null,null,null,"",null,null,null,null,null,"",null,null,null,null,null,null,null,null,null,null,null,{"$f":"COUNTIF(D52, {\"*-*\"})-COUNTIF(D52, {\"-*\"})","v":0},{"$f":"COUNTIF(D52, {\"*_*\"})","v":0},"","","",""]
[null,null,null,null,null,null,null,null,null,null,null,null,null,null,null,"",null,null,null,null,null,"",null,null,null,null,null,null,null,null,null,null,null,{"$f":"COUNTIF(D53, {\"*-*\"})-COUNTIF(D53, {\"-*\"})","v":0},{"$f":"COUNTIF(D53, {\"*_*\"})","v":0},"","","",""]
[null,null,null,null,null,null,null,null,null,null,null,null,null,null,null,"",null,null,null,null,null,"",null,null,null,null,null,null,null,null,null,null,null,{"$f":"COUNTIF(D54, {\"*-*\"})-COUNTIF(D54, {\"-*\"})","v":0},{"$f":"COUNTIF(D54, {\"*_*\"})","v":0},"","","",""]
[null,null,null,null,null,null,null,null,null,null,null,null,null,null,null,"",null,null,null,null,null,"",null,null,null,null,null,null,null,null,null,null,null,{"$f":"COUNTIF(D55, {\"*-*\"})-COUNTIF(D55, {\"-*\"})","v":0},{"$f":"COUNTIF(D55, {\"*_*\"})","v":0},"","","",""]
[null,null,null,null,null,null,null,null,null,null,null,null,null,null,null,"",null,null,null,null,null,"",null,null,null,null,null,null,null,null,null,null,null,{"$f":"COUNTIF(D56, {\"*-*\"})-COUNTIF(D56, {\"-*\"})","v":0},{"$f":"COUNTIF(D56, {\"*_*\"})","v":0},"","","",""]
[null,null,null,null,null,null,null,null,null,null,null,null,null,null,null,"",null,null,null,null,null,"",null,null,null,null,null,null,null,null,null,null,null,{"$f":"COUNTIF(D57, {\"*-*\"})-COUNTIF(D57, {\"-*\"})","v":0},{"$f":"COUNTIF(D57, {\"*_*\"})","v":0},"","","",""]
[null,null,null,null,null,null,null,null,null,null,null,null,null,null,null,"",null,null,null,null,null,"",null,null,null,null,null,null,null,null,null,null,null,{"$f":"COUNTIF(D58, {\"*-*\"})-COUNTIF(D58, {\"-*\"})","v":0},{"$f":"COUNTIF(D58, {\"*_*\"})","v":0},"","","",""]
[null,null,null,null,null,null,null,null,null,null,null,null,null,null,null,"",null,null,null,null,null,"",null,null,null,null,null,null,null,null,null,null,null,{"$f":"COUNTIF(D59, {\"*-*\"})-COUNTIF(D59, {\"-*\"})","v":0},{"$f":"COUNTIF(D59, {\"*_*\"})","v":0},"","","",""]
[null,null,null,null,null,null,null,null,null,null,null,null,null,null,null,"",null,null,null,null,null,"",null,null,null,null,null,null,null,null,null,null,null,{"$f":"COUNTIF(D60, {\"*-*\"})-COUNTIF(D60, {\"-*\"})","v":0},{"$f":"COUNTIF(D60, {\"*_*\"})","v":0},"","","",""]
[null,null,null,null,null,null,null,null,null,null,null,null,null,null,null,"",null,null,null,null,null,"",null,null,null,null,null,null,null,null,null,null,null,{"$f":"COUNTIF(D61, {\"*-*\"})-COUNTIF(D61, {\"-*\"})","v":0},{"$f":"COUNTIF(D61, {\"*_*\"})","v":0},"","","",""]
[null,null,null,null,null,null,null,null,null,null,null,null,null,null,null,"",null,null,null,null,null,"",null,null,null,null,null,null,null,null,null,null,null,{"$f":"COUNTIF(D62, {\"*-*\"})-COUNTIF(D62, {\"-*\"})","v":0},{"$f":"COUNTIF(D62, {\"*_*\"})","v":0},"","","",""]
[null,null,null,null,null,null,null,null,null,null,null,null,null,null,null,"",null,null,null,null,null,"",null,null,null,null,null,null,null,null,null,null,null,{"$f":"COUNTIF(D63, {\"*-*\"})-COUNTIF(D63, {\"-*\"})","v":0},{"$f":"COUNTIF(D63, {\"*_*\"})","v":0},"","","",""]
[null,null,null,null,null,null,null,null,null,null,null,null,null,null,null,"",null,null,null,null,null,"",null,null,null,null,null,null,null,null,null,null,null,{"$f":"COUNTIF(D64, {\"*-*\"})-COUNTIF(D64, {\"-*\"})","v":0},{"$f":"COUNTIF(D64, {\"*_*\"})","v":0},"","","",""]
[null,null,null,null,null,null,null,null,null,null,null,null,null,null,null,"",null,null,null,null,null,"",null,null,null,null,null,null,null,null,null,null,null,{"$f":"COUNTIF(D65, {\"*-*\"})-COUNTIF(D65, {\"-*\"})","v":0},{"$f":"COUNTIF(D65, {\"*_*\"})","v":0},"","","",""]
[null,null,null,null,null,null,null,null,null,null,null,null,null,null,null,"",null,null,null,null,null,"",null,null,null,null,null,null,null,null,null,null,null,{"$f":"COUNTIF(D66, {\"*-*\"})-COUNTIF(D66, {\"-*\"})","v":0},{"$f":"COUNTIF(D66, {\"*_*\"})","v":0},"","","",""]
[null,null,null,null,null,null,null,null,null,null,null,null,null,null,null,"",null,null,null,null,null,"",null,null,null,null,null,null,null,null,null,null,null,{"$f":"COUNTIF(D67, {\"*-*\"})-COUNTIF(D67, {\"-*\"})","v":0},{"$f":"COUNTIF(D67, {\"*_*\"})","v":0},"","","",""]
[null,null,null,null,null,null,null,null,null,null,null,null,null,null,null,"",null,null,null,null,null,"",null,null,null,null,null,null,null,null,null,null,null,{"$f":"COUNTIF(D68, {\"*-*\"})-COUNTIF(D68, {\"-*\"})","v":0},{"$f":"COUNTIF(D68, {\"*_*\"})","v":0},"","","",""]
[null,null,null,null,null,null,null,null,null,null,null,null,null,null,null,"",null,null,null,null,null,"",null,null,null,null,null,null,null,null,null,null,null,{"$f":"COUNTIF(D69, {\"*-*\"})-COUNTIF(D69, {\"-*\"})","v":0},{"$f":"COUNTIF(D69, {\"*_*\"})","v":0},"","","",""]
[null,null,null,null,null,null,null,null,null,null,null,null,null,null,null,"",null,null,null,null,null,"",null,null,null,null,null,null,null,null,null,null,null,{"$f":"COUNTIF(D70, {\"*-*\"})-COUNTIF(D70, {\"-*\"})","v":0},{"$f":"COUNTIF(D70, {\"*_*\"})","v":0},"","","",""]
[null,null,null,null,null,null,null,null,null,null,null,null,null,null,null,"",null,null,null,null,null,"",null,null,null,null,null,null,null,null,null,null,null,{"$f":"COUNTIF(D71, {\"*-*\"})-COUNTIF(D71, {\"-*\"})","v":0},{"$f":"COUNTIF(D71, {\"*_*\"})","v":0},"","","",""]
[null,null,null,null,null,null,null,null,null,null,null,null,null,null,null,"",null,null,null,null,null,"",null,null,null,null,null,null,null,null,null,null,null,{"$f":"COUNTIF(D72, {\"*-*\"})-COUNTIF(D72, {\"-*\"})","v":0},{"$f":"COUNTIF(D72, {\"*_*\"})","v":0},"","","",""]
[null,null,null,null,null,null,null,null,null,null,null,null,null,null,null,"",null,null,null,null,null,"",null,null,null,null,null,null,null,null,null,null,null,{"$f":"COUNTIF(D73, {\"*-*\"})-COUNTIF(D73, {\"-*\"})","v":0},{"$f":"COUNTIF(D73, {\"*_*\"})","v":0},"","","",""]
[null,null,null,null,null,null,null,null,null,null,null,null,null,null,null,"",null,null,null,null,null,"",null,null,null,null,null,null,null,null,null,null,null,{"$f":"COUNTIF(D74, {\"*-*\"})-COUNTIF(D74, {\"-*\"})","v":0},{"$f":"COUNTIF(D74, {\"*_*\"})","v":0},"","","",""]
[null,null,null,null,null,null,null,null,null,null,null,null,null,null,null,"",null,null,null,null,null,"",null,null,null,null,null,null,null,null,null,null,null,{"$f":"COUNTIF(D75, {\"*-*\"})-COUNTIF(D75, {\"-*\"})","v":0},{"$f":"COUNTIF(D75, {\"*_*\"})","v":0},"","","",""]
[null,null,null,null,null,null,null,null,null,null,null,null,null,null,null,"",null,null,null,null,null,"",null,null,null,null,null,null,null,null,null,null,null,{"$f":"COUNTIF(D76, {\"*-*\"})-COUNTIF(D76, {\"-*\"})","v":0},{"$f":"COUNTIF(D76, {\"*_*\"})","v":0},"","","",""]
[null,null,null,null,null,null,null,null,null,null,null,null,null,null,null,"",null,null,null,null,null,"",null,null,null,null,null,null,null,null,null,null,null,{"$f":"COUNTIF(D77, {\"*-*\"})-COUNTIF(D77, {\"-*\"})","v":0},{"$f":"COUNTIF(D77, {\"*_*\"})","v":0},"","","",""]
[null,null,null,null,null,null,null,null,null,null,null,null,null,null,null,"",null,null,null,null,null,"",null,null,null,null,null,null,null,null,null,null,null,{"$f":"COUNTIF(D78, {\"*-*\"})-COUNTIF(D78, {\"-*\"})","v":0},{"$f":"COUNTIF(D78, {\"*_*\"})","v":0},"","","",""]
[null,null,null,null,null,null,null,null,null,null,null,null,null,null,null,"",null,null,null,null,null,"",null,null,null,null,null,null,null,null,null,null,null,{"$f":"COUNTIF(D79, {\"*-*\"})-COUNTIF(D79, {\"-*\"})","v":0},{"$f":"COUNTIF(D79, {\"*_*\"})","v":0},"","","",""]
[null,null,null,null,null,null,null,null,null,null,null,null,null,null,null,"",null,null,null,null,null,"",null,null,null,null,null,null,null,null,null,null,null,{"$f":"COUNTIF(D80, {\"*-*\"})-COUNTIF(D80, {\"-*\"})","v":0},{"$f":"COUNTIF(D80, {\"*_*\"})","v":0},"","","",""]
[null,null,null,null,null,null,null,null,null,null,null,null,null,null,null,"",null,null,null,null,null,"",null,null,null,null,null,null,null,null,null,null,null,{"$f":"COUNTIF(D81, {\"*-*\"})-COUNTIF(D81, {\"-*\"})","v":0},{"$f":"COUNTIF(D81, {\"*_*\"})","v":0},"","","",""]
[null,null,null,null,null,null,null,null,null,null,null,null,null,null,null,"",null,null,null,null,null,"",null,null,null,null,null,null,null,null,null,null,null,{"$f":"COUNTIF(D82, {\"*-*\"})-COUNTIF(D82, {\"-*\"})","v":0},{"$f":"COUNTIF(D82, {\"*_*\"})","v":0},"","","",""]
[null,null,null,null,null,null,null,null,null,null,null,null,null,null,null,"",null,null,null,null,null,"",null,null,null,null,null,null,null,null,null,null,null,{"$f":"COUNTIF(D83, {\"*-*\"})-COUNTIF(D83, {\"-*\"})","v":0},{"$f":"COUNTIF(D83, {\"*_*\"})","v":0},"","","",""]
[null,null,null,null,null,null,null,null,null,null,null,null,null,null,null,"",null,null,null,null,null,"",null,null,null,null,null,null,null,null,null,null,null,{"$f":"COUNTIF(D84, {\"*-*\"})-COUNTIF(D84, {\"-*\"})","v":0},{"$f":"COUNTIF(D84, {\"*_*\"})","v":0},"","","",""]
[null,null,null,null,null,null,null,null,null,null,null,null,null,null,null,"",null,null,null,null,null,"",null,null,null,null,null,null,null,null,null,null,null,{"$f":"COUNTIF(D85, {\"*-*\"})-COUNTIF(D85, {\"-*\"})","v":0},{"$f":"COUNTIF(D85, {\"*_*\"})","v":0},"","","",""]
[null,null,null,null,null,null,null,null,null,null,null,null,null,null,null,"",null,null,null,null,null,"",null,null,null,null,null,null,null,null,null,null,null,{"$f":"COUNTIF(D86, {\"*-*\"})-COUNTIF(D86, {\"-*\"})","v":0},{"$f":"COUNTIF(D86, {\"*_*\"})","v":0},"","","",""]
[null,null,null,null,null,null,null,null,null,null,null,null,null,null,null,"",null,null,null,null,null,"",null,null,null,null,null,null,null,null,null,null,null,{"$f":"COUNTIF(D87, {\"*-*\"})-COUNTIF(D87, {\"-*\"})","v":0},{"$f":"COUNTIF(D87, {\"*_*\"})","v":0},"","","",""]
[null,null,null,null,null,null,null,null,null,null,null,null,null,null,null,"",null,null,null,null,null,"",null,null,null,null,null,null,null,null,null,null,null,{"$f":"COUNTIF(D88, {\"*-*\"})-COUNTIF(D88, {\"-*\"})","v":0},{"$f":"COUNTIF(D88, {\"*_*\"})","v":0},"","","",""]
[null,null,null,null,null,null,null,null,null,null,null,null,null,null,null,"",null,null,null,null,null,"",null,null,null,null,null,null,null,null,null,null,null,{"$f":"COUNTIF(D89, {\"*-*\"})-COUNTIF(D89, {\"-*\"})","v":0},{"$f":"COUNTIF(D89, {\"*_*\"})","v":0},"","","",""]
[null,null,null,null,null,null,null,null,null,null,null,null,null,null,null,"",null,null,null,null,null,"",null,null,null,null,null,null,null,null,null,null,null,{"$f":"COUNTIF(D90, {\"*-*\"})-COUNTIF(D90, {\"-*\"})","v":0},{"$f":"COUNTIF(D90, {\"*_*\"})","v":0},"","","",""]
[null,null,null,null,null,null,null,null,null,null,null,null,null,null,null,"",null,null,null,null,null,"",null,null,null,null,null,null,null,null,null,null,null,{"$f":"COUNTIF(D91, {\"*-*\"})-COUNTIF(D91, {\"-*\"})","v":0},{"$f":"COUNTIF(D91, {\"*_*\"})","v":0},"","","",""]
[null,null,null,null,null,null,null,null,null,null,null,null,null,null,null,"",null,null,null,null,null,"",null,null,null,null,null,null,null,null,null,null,null,{"$f":"COUNTIF(D92, {\"*-*\"})-COUNTIF(D92, {\"-*\"})","v":0},{"$f":"COUNTIF(D92, {\"*_*\"})","v":0},"","","",""]
[null,null,null,null,null,null,null,null,null,null,null,null,null,null,null,"",null,null,null,null,null,"",null,null,null,null,null,null,null,null,null,null,null,{"$f":"COUNTIF(D93, {\"*-*\"})-COUNTIF(D93, {\"-*\"})","v":0},{"$f":"COUNTIF(D93, {\"*_*\"})","v":0},"","","",""]
[null,null,null,null,null,null,null,null,null,null,null,null,null,null,null,"",null,null,null,null,null,"",null,null,null,null,null,null,null,null,null,null,null,{"$f":"COUNTIF(D94, {\"*-*\"})-COUNTIF(D94, {\"-*\"})","v":0},{"$f":"COUNTIF(D94, {\"*_*\"})","v":0},"","","",""]
[null,null,null,null,null,null,null,null,null,null,null,null,null,null,null,"",null,null,null,null,null,"",null,null,null,null,null,null,null,null,null,null,null,{"$f":"COUNTIF(D95, {\"*-*\"})-COUNTIF(D95, {\"-*\"})","v":0},{"$f":"COUNTIF(D95, {\"*_*\"})","v":0},"","","",""]
[null,null,null,null,null,null,null,null,null,null,null,null,null,null,null,"",null,null,null,null,null,"",null,null,null,null,null,null,null,null,null,null,null,{"$f":"COUNTIF(D96, {\"*-*\"})-COUNTIF(D96, {\"-*\"})","v":0},{"$f":"COUNTIF(D96, {\"*_*\"})","v":0},"","","",""]
[null,null,null,null,null,null,null,null,null,null,null,null,null,null,null,"",null,null,null,null,null,"",null,null,null,null,null,null,null,null,null,null,null,{"$f":"COUNTIF(D97, {\"*-*\"})-COUNTIF(D97, {\"-*\"})","v":0},{"$f":"COUNTIF(D97, {\"*_*\"})","v":0},"","","",""]
[null,null,null,null,null,null,null,null,null,null,null,null,null,null,null,"",null,null,null,null,null,"",null,null,null,null,null,null,null,null,null,null,null,{"$f":"COUNTIF(D98, {\"*-*\"})-COUNTIF(D98, {\"-*\"})","v":0},{"$f":"COUNTIF(D98, {\"*_*\"})","v":0},"","","",""]
[null,null,null,null,null,null,null,null,null,null,null,null,null,null,null,"",null,null,null,null,null,"",null,null,null,null,null,null,null,null,null,null,null,{"$f":"COUNTIF(D99, {\"*-*\"})-COUNTIF(D99, {\"-*\"})","v":0},{"$f":"COUNTIF(D99, {\"*_*\"})","v":0},"","","",""]
[null,null,null,null,null,null,null,null,null,null,null,null,null,null,null,"",null,null,null,null,null,"",null,null,null,null,null,null,null,null,null,null,null,{"$f":"COUNTIF(D100, {\"*-*\"})-COUNTIF(D100, {\"-*\"})","v":0},{"$f":"COUNTIF(D100, {\"*_*\"})","v":0},"","","",""]
[null,null,null,null,null,null,null,null,null,null,null,null,null,null,null,"",null,null,null,null,null,"",null,null,null,null,null,null,null,null,null,null,null,{"$f":"COUNTIF(D101, {\"*-*\"})-COUNTIF(D101, {\"-*\"})","v":0},{"$f":"COUNTIF(D101, {\"*_*\"})","v":0},"","","",""]
[null,null,null,null,null,null,null,null,null,null,null,null,null,null,null,"",null,null,null,null,null,"",null,null,null,null,null,null,null,null,null,null,null,{"$f":"COUNTIF(D102, {\"*-*\"})-COUNTIF(D102, {\"-*\"})","v":0},{"$f":"COUNTIF(D102, {\"*_*\"})","v":0},"","","",""]
[null,null,null,null,null,null,null,null,null,null,null,null,null,null,null,"",null,null,null,null,null,"",null,null,null,null,null,null,null,null,null,null,null,{"$f":"COUNTIF(D103, {\"*-*\"})-COUNTIF(D103, {\"-*\"})","v":0},{"$f":"COUNTIF(D103, {\"*_*\"})","v":0},"","","",""]
[null,null,null,null,null,null,null,null,null,null,null,null,null,null,null,"",null,null,null,null,null,"",null,null,null,null,null,null,null,null,null,null,null,{"$f":"COUNTIF(D104, {\"*-*\"})-COUNTIF(D104, {\"-*\"})","v":0},{"$f":"COUNTIF(D104, {\"*_*\"})","v":0},"","","",""]
[null,null,null,null,null,null,null,null,null,null,null,null,null,null,null,"",null,null,null,null,null,"",null,null,null,null,null,null,null,null,null,null,null,{"$f":"COUNTIF(D105, {\"*-*\"})-COUNTIF(D105, {\"-*\"})","v":0},{"$f":"COUNTIF(D105, {\"*_*\"})","v":0},"","","",""]
[null,null,null,null,null,null,null,null,null,null,null,null,null,null,null,"",null,null,null,null,null,"",null,null,null,null,null,null,null,null,null,null,null,{"$f":"COUNTIF(D106, {\"*-*\"})-COUNTIF(D106, {\"-*\"})","v":0},{"$f":"COUNTIF(D106, {\"*_*\"})","v":0},"","","",""]
[null,null,null,null,null,null,null,null,null,null,null,null,null,null,null,"",null,null,null,null,null,"",null,null,null,null,null,null,null,null,null,null,null,{"$f":"COUNTIF(D107, {\"*-*\"})-COUNTIF(D107, {\"-*\"})","v":0},{"$f":"COUNTIF(D107, {\"*_*\"})","v":0},"","","",""]
[null,null,null,null,null,null,null,null,null,null,null,null,null,null,null,"",null,null,null,null,null,"",null,null,null,null,null,null,null,null,null,null,null,{"$f":"COUNTIF(D108, {\"*-*\"})-COUNTIF(D108, {\"-*\"})","v":0},{"$f":"COUNTIF(D108, {\"*_*\"})","v":0},"","","",""]
[null,null,null,null,null,null,null,null,null,null,null,null,null,null,null,"",null,null,null,null,null,"",null,null,null,null,null,null,null,null,null,null,null,{"$f":"COUNTIF(D109, {\"*-*\"})-COUNTIF(D109, {\"-*\"})","v":0},{"$f":"COUNTIF(D109, {\"*_*\"})","v":0},"","","",""]
[null,null,null,null,null,null,null,null,null,null,null,null,null,null,null,{"$f":"IF($C$10=\"\",\"\",IF($C$9=\"\",\"\",IF(Q110=\"\",\"\",IF(T110=\"\",\"\",ROUND(($C$10-$C$9)*24+((T110-Q110)*24),0)))))","v":""},null,null,null,null,null,{"$f":"IF(Q110=\"\",\"\",IF((COUNTA(Q110)*2)<>COUNTA($C$9,$C$10),\"Husk start og slut dato i C9 OG C10\",\"\"))","v":""},null,null,null,null,null,null,null,null,null,null,null,{"$f":"COUNTIF(D110, {\"*-*\"})-COUNTIF(D110, {\"-*\"})","v":0},{"$f":"COUNTIF(D110, {\"*_*\"})","v":0},{"$f":"IF(Q110=\"\",\"\",HOUR(Q110))","v":""},{"$f":"IF(Q110=\"\",\"\",MINUTE(Q110))","v":""},{"$f":"IF(T110=\"\",\"\",HOUR(T110))","v":""},{"$f":"IF(T110=\"\",\"\",MINUTE(T110))","v":""}]
[null,null,null,null,null,null,null,null,null,null,null,null,null,null,null,"",null,null,null,null,null,"",null,null,null,null,null,null,null,null,null,null,null,{"$f":"COUNTIF(D111, {\"*-*\"})-COUNTIF(D111, {\"-*\"})","v":0},{"$f":"COUNTIF(D111, {\"*_*\"})","v":0},"","","",""]
[null,null,null,null,null,null,null,null,null,null,null,null,null,null,null,"",null,null,null,null,null,"",null,null,null,null,null,null,null,null,null,null,null,{"$f":"COUNTIF(D112, {\"*-*\"})-COUNTIF(D112, {\"-*\"})","v":0},{"$f":"COUNTIF(D112, {\"*_*\"})","v":0},"","","",""]
[null,null,null,null,null,null,null,null,null,null,null,null,null,null,null,"",null,null,null,null,null,"",null,null,null,null,null,null,null,null,null,null,null,{"$f":"COUNTIF(D113, {\"*-*\"})-COUNTIF(D113, {\"-*\"})","v":0},{"$f":"COUNTIF(D113, {\"*_*\"})","v":0},"","","",""]
[null,null,null,null,null,null,null,null,null,null,null,null,null,null,null,"",null,null,null,null,null,"",null,null,null,null,null,null,null,null,null,null,null,{"$f":"COUNTIF(D114, {\"*-*\"})-COUNTIF(D114, {\"-*\"})","v":0},{"$f":"COUNTIF(D114, {\"*_*\"})","v":0},"","","",""]
[null,null,null,null,null,null,null,null,null,null,null,null,null,null,null,"",null,null,null,null,null,"",null,null,null,null,null,null,null,null,null,null,null,{"$f":"COUNTIF(D115, {\"*-*\"})-COUNTIF(D115, {\"-*\"})","v":0},{"$f":"COUNTIF(D115, {\"*_*\"})","v":0},"","","",""]
[null,null,null,null,null,null,null,null,null,null,null,null,null,null,null,"",null,null,null,null,null,"",null,null,null,null,null,null,null,null,null,null,null,{"$f":"COUNTIF(D116, {\"*-*\"})-COUNTIF(D116, {\"-*\"})","v":0},{"$f":"COUNTIF(D116, {\"*_*\"})","v":0},"","","",""]
[null,null,null,null,null,null,null,null,null,null,null,null,null,null,null,"",null,null,null,null,null,"",null,null,null,null,null,null,null,null,null,null,null,{"$f":"COUNTIF(D117, {\"*-*\"})-COUNTIF(D117, {\"-*\"})","v":0},{"$f":"COUNTIF(D117, {\"*_*\"})","v":0},"","","",""]
[null,null,null,null,null,null,null,null,null,null,null,null,null,null,null,"",null,null,null,null,null,"",null,null,null,null,null,null,null,null,null,null,null,{"$f":"COUNTIF(D118, {\"*-*\"})-COUNTIF(D118, {\"-*\"})","v":0},{"$f":"COUNTIF(D118, {\"*_*\"})","v":0},"","","",""]
[null,null,null,null,null,null,null,null,null,null,null,null,null,null,null,"",null,null,null,null,null,"",null,null,null,null,null,null,null,null,null,null,null,{"$f":"COUNTIF(D119, {\"*-*\"})-COUNTIF(D119, {\"-*\"})","v":0},{"$f":"COUNTIF(D119, {\"*_*\"})","v":0},"","","",""]
[null,null,null,null,null,null,null,null,null,null,null,null,null,null,null,"",null,null,null,null,null,"",null,null,null,null,null,null,null,null,null,null,null,{"$f":"COUNTIF(D120, {\"*-*\"})-COUNTIF(D120, {\"-*\"})","v":0},{"$f":"COUNTIF(D120, {\"*_*\"})","v":0},"","","",""]
[null,null,null,null,null,null,null,null,null,null,null,null,null,null,null,"",null,null,null,null,null,"",null,null,null,null,null,null,null,null,null,null,null,{"$f":"COUNTIF(D121, {\"*-*\"})-COUNTIF(D121, {\"-*\"})","v":0},{"$f":"COUNTIF(D121, {\"*_*\"})","v":0},"","","",""]
[null,null,null,null,null,null,null,null,null,null,null,null,null,null,null,"",null,null,null,null,null,"",null,null,null,null,null,null,null,null,null,null,null,{"$f":"COUNTIF(D122, {\"*-*\"})-COUNTIF(D122, {\"-*\"})","v":0},{"$f":"COUNTIF(D122, {\"*_*\"})","v":0},"","","",""]
[null,null,null,null,null,null,null,null,null,null,null,null,null,null,null,"",null,null,null,null,null,"",null,null,null,null,null,null,null,null,null,null,null,{"$f":"COUNTIF(D123, {\"*-*\"})-COUNTIF(D123, {\"-*\"})","v":0},{"$f":"COUNTIF(D123, {\"*_*\"})","v":0},"","","",""]
[null,null,null,null,null,null,null,null,null,null,null,null,null,null,null,"",null,null,null,null,null,"",null,null,null,null,null,null,null,null,null,null,null,{"$f":"COUNTIF(D124, {\"*-*\"})-COUNTIF(D124, {\"-*\"})","v":0},{"$f":"COUNTIF(D124, {\"*_*\"})","v":0},"","","",""]
[null,null,null,null,null,null,null,null,null,null,null,null,null,null,null,"",null,null,null,null,null,"",null,null,null,null,null,null,null,null,null,null,null,{"$f":"COUNTIF(D125, {\"*-*\"})-COUNTIF(D125, {\"-*\"})","v":0},{"$f":"COUNTIF(D125, {\"*_*\"})","v":0},"","","",""]
[null,null,null,null,null,null,null,null,null,null,null,null,null,null,null,"",null,null,null,null,null,"",null,null,null,null,null,null,null,null,null,null,null,{"$f":"COUNTIF(D126, {\"*-*\"})-COUNTIF(D126, {\"-*\"})","v":0},{"$f":"COUNTIF(D126, {\"*_*\"})","v":0},"","","",""]
[null,null,null,null,null,null,null,null,null,null,null,null,null,null,null,"",null,null,null,null,null,"",null,null,null,null,null,null,null,null,null,null,null,{"$f":"COUNTIF(D127, {\"*-*\"})-COUNTIF(D127, {\"-*\"})","v":0},{"$f":"COUNTIF(D127, {\"*_*\"})","v":0},"","","",""]
[null,null,null,null,null,null,null,null,null,null,null,null,null,null,null,"",null,null,null,null,null,"",null,null,null,null,null,null,null,null,null,null,null,{"$f":"COUNTIF(D128, {\"*-*\"})-COUNTIF(D128, {\"-*\"})","v":0},{"$f":"COUNTIF(D128, {\"*_*\"})","v":0},"","","",""]
[null,null,null,null,null,null,null,null,null,null,null,null,null,null,null,"",null,null,null,null,null,"",null,null,null,null,null,null,null,null,null,null,null,{"$f":"COUNTIF(D129, {\"*-*\"})-COUNTIF(D129, {\"-*\"})","v":0},{"$f":"COUNTIF(D129, {\"*_*\"})","v":0},"","","",""]
[null,null,null,null,null,null,null,null,null,null,null,null,null,null,null,"",null,null,null,null,null,"",null,null,null,null,null,null,null,null,null,null,null,{"$f":"COUNTIF(D130, {\"*-*\"})-COUNTIF(D130, {\"-*\"})","v":0},{"$f":"COUNTIF(D130, {\"*_*\"})","v":0},"","","",""]
[null,null,null,null,null,null,null,null,null,null,null,null,null,null,null,"",null,null,null,null,null,"",null,null,null,null,null,null,null,null,null,null,null,{"$f":"COUNTIF(D131, {\"*-*\"})-COUNTIF(D131, {\"-*\"})","v":0},{"$f":"COUNTIF(D131, {\"*_*\"})","v":0},"","","",""]
[null,null,null,null,null,null,null,null,null,null,null,null,null,null,null,"",null,null,null,null,null,"",null,null,null,null,null,null,null,null,null,null,null,{"$f":"COUNTIF(D132, {\"*-*\"})-COUNTIF(D132, {\"-*\"})","v":0},{"$f":"COUNTIF(D132, {\"*_*\"})","v":0},"","","",""]
[null,null,null,null,null,null,null,null,null,null,null,null,null,null,null,"",null,null,null,null,null,"",null,null,null,null,null,null,null,null,null,null,null,{"$f":"COUNTIF(D133, {\"*-*\"})-COUNTIF(D133, {\"-*\"})","v":0},{"$f":"COUNTIF(D133, {\"*_*\"})","v":0},"","","",""]
[null,null,null,null,null,null,null,null,null,null,null,null,null,null,null,"",null,null,null,null,null,"",null,null,null,null,null,null,null,null,null,null,null,{"$f":"COUNTIF(D134, {\"*-*\"})-COUNTIF(D134, {\"-*\"})","v":0},{"$f":"COUNTIF(D134, {\"*_*\"})","v":0},"","","",""]
[null,null,null,null,null,null,null,null,null,null,null,null,null,null,null,"",null,null,null,null,null,"",null,null,null,null,null,null,null,null,null,null,null,{"$f":"COUNTIF(D135, {\"*-*\"})-COUNTIF(D135, {\"-*\"})","v":0},{"$f":"COUNTIF(D135, {\"*_*\"})","v":0},"","","",""]
[null,null,null,null,null,null,null,null,null,null,null,null,null,null,null,"",null,null,null,null,null,"",null,null,null,null,null,null,null,null,null,null,null,{"$f":"COUNTIF(D136, {\"*-*\"})-COUNTIF(D136, {\"-*\"})","v":0},{"$f":"COUNTIF(D136, {\"*_*\"})","v":0},"","","",""]
[null,null,null,null,null,null,null,null,null,null,null,null,null,null,null,"",null,null,null,null,null,"",null,null,null,null,null,null,null,null,null,null,null,{"$f":"COUNTIF(D137, {\"*-*\"})-COUNTIF(D137, {\"-*\"})","v":0},{"$f":"COUNTIF(D137, {\"*_*\"})","v":0},"","","",""]
[null,null,null,null,null,null,null,null,null,null,null,null,null,null,null,"",null,null,null,null,null,"",null,null,null,null,null,null,null,null,null,null,null,{"$f":"COUNTIF(D138, {\"*-*\"})-COUNTIF(D138, {\"-*\"})","v":0},{"$f":"COUNTIF(D138, {\"*_*\"})","v":0},"","","",""]
[null,null,null,null,null,null,null,null,null,null,null,null,null,null,null,"",null,null,null,null,null,"",null,null,null,null,null,null,null,null,null,null,null,{"$f":"COUNTIF(D139, {\"*-*\"})-COUNTIF(D139, {\"-*\"})","v":0},{"$f":"COUNTIF(D139, {\"*_*\"})","v":0},"","","",""]
[null,null,null,null,null,null,null,null,null,null,null,null,null,null,null,"",null,null,null,null,null,"",null,null,null,null,null,null,null,null,null,null,null,{"$f":"COUNTIF(D140, {\"*-*\"})-COUNTIF(D140, {\"-*\"})","v":0},{"$f":"COUNTIF(D140, {\"*_*\"})","v":0},"","","",""]
[null,null,null,null,null,null,null,null,null,null,null,null,null,null,null,"",null,null,null,null,null,"",null,null,null,null,null,null,null,null,null,null,null,{"$f":"COUNTIF(D141, {\"*-*\"})-COUNTIF(D141, {\"-*\"})","v":0},{"$f":"COUNTIF(D141, {\"*_*\"})","v":0},"","","",""]
[null,null,null,null,null,null,null,null,null,null,null,null,null,null,null,"",null,null,null,null,null,"",null,null,null,null,null,null,null,null,null,null,null,{"$f":"COUNTIF(D142, {\"*-*\"})-COUNTIF(D142, {\"-*\"})","v":0},{"$f":"COUNTIF(D142, {\"*_*\"})","v":0},"","","",""]
[null,null,null,null,null,null,null,null,null,null,null,null,null,null,null,"",null,null,null,null,null,"",null,null,null,null,null,null,null,null,null,null,null,{"$f":"COUNTIF(D143, {\"*-*\"})-COUNTIF(D143, {\"-*\"})","v":0},{"$f":"COUNTIF(D143, {\"*_*\"})","v":0},"","","",""]
[null,null,null,null,null,null,null,null,null,null,null,null,null,null,null,"",null,null,null,null,null,"",null,null,null,null,null,null,null,null,null,null,null,{"$f":"COUNTIF(D144, {\"*-*\"})-COUNTIF(D144, {\"-*\"})","v":0},{"$f":"COUNTIF(D144, {\"*_*\"})","v":0},"","","",""]
["ALS afrapporterer max. 100 prøver pr. sag. Såfremt der fremsendes flere end 100 prøver samtidigt, udfyldes flere rekvisitioner."]

{"sheet":"7. Luft-ATD","index":6,"n_rows":44,"n_cols":20,"rows_kept":44,"cut":false,"hidden":false,"merged":[[98,5,98,6],[99,5,99,6],[100,5,100,6],[101,5,101,6],[102,5,102,6],[103,5,103,6],[104,5,104,6],[89,5,89,6],[90,5,90,6],[91,5,91,6],[92,5,92,6],[93,5,93,6],[94,5,94,6],[95,5,95,6],[96,5,96,6],[97,5,97,6],[80,5,80,6],[81,5,81,6],[82,5,82,6],[83,5,83,6],[84,5,84,6],[85,5,85,6],[86,5,86,6],[87,5,87,6],[88,5,88,6],[71,5,71,6],[72,5,72,6],[73,5,73,6],[74,5,74,6],[75,5,75,6],[76,5,76,6],[77,5,77,6],[78,5,78,6],[79,5,79,6],[62,5,62,6],[63,5,63,6],[64,5,64,6],[65,5,65,6],[66,5,66,6],[67,5,67,6],[68,5,68,6],[69,5,69,6],[70,5,70,6],[53,5,53,6],[54,5,54,6],[55,5,55,6],[56,5,56,6],[57,5,57,6],[58,5,58,6],[59,5,59,6],[60,5,60,6],[61,5,61,6],[44,5,44,6],[45,5,45,6],[46,5,46,6],[47,5,47,6],[48,5,48,6],[49,5,49,6],[50,5,50,6],[51,5,51,6],[52,5,52,6],[21,4,21,8],[22,4,22,8],[4,11,4,13],[4,14,4,18],[4,2,4,10],[1,0,2,19],[3,2,3,4],[3,9,3,18],[14,2,14,6],[14,9,14,17],[8,15,8,16],[8,17,8,18],[18,2,18,6],[18,9,18,17],[17,9,17,17],[11,9,12,19],[10,2,10,5],[11,2,11,5],[7,2,7,5],[9,2,9,5],[140,1,140,2],[140,5,140,6],[140,7,140,8],[140,9,140,10],[140,11,140,12],[140,13,140,14],[138,1,138,2],[138,5,138,6],[138,7,138,8],[138,9,138,10],[138,11,138,12],[138,13,138,14],[139,1,139,2],[139,5,139,6],[139,7,139,8],[139,9,139,10],[139,11,139,12],[139,13,139,14],[134,13,134,14],[143,13,143,14],[141,1,141,2],[141,5,141,6],[141,7,141,8],[141,9,141,10],[141,11,141,12],[141,13,141,14],[142,1,142,2],[142,5,142,6],[142,7,142,8],[142,9,142,10],[142,11,142,12],[142,13,142,14],[134,5,134,6],[134,7,134,8],[134,9,134,10],[134,11,134,12],[143,1,143,2],[143,5,143,6],[143,7,143,8],[143,9,143,10],[143,11,143,12],[136,1,136,2],[136,5,136,6],[136,7,136,8],[136,9,136,10],[136,11,136,12],[127,1,127,2],[127,5,127,6],[127,7,127,8],[127,9,127,10],[127,11,127,12],[134,1,134,2],[127,13,127,14],[135,1,135,2],[135,5,135,6],[135,7,135,8],[135,9,135,10],[135,11,135,12],[135,13,135,14],[132,7,132,8],[132,9,132,10],[132,11,132,12],[132,13,132,14],[133,1,133,2],[133,5,133,6],[133,7,133,8],[133,9,133,10],[133,11,133,12],[133,13,133,14],[132,1,132,2],[132,5,132,6],[128,1,128,2],[128,5,128,6],[128,7,128,8],[128,9,128,10],[128,11,128,12],[125,1,125,2],[125,5,125,6],[125,7,125,8],[125,9,125,10],[125,11,125,12],[125,13,125,14],[124,1,124,2],[124,5,124,6],[126,1,126,2],[126,5,126,6],[126,7,126,8],[126,9,126,10],[126,11,126,12],[126,13,126,14],[119,1,119,2],[119,5,119,6],[119,7,119,8],[119,9,119,10],[119,11,119,12],[119,13,119,14],[124,7,124,8],[124,9,124,10],[124,11,124,12],[124,13,124,14],[120,1,120,2],[120,5,120,6],[120,7,120,8],[120,9,120,10],[120,11,120,12],[120,13,120,14],[121,1,121,2],[121,5,121,6],[123,1,123,2],[123,5,123,6],[123,7,123,8],[123,9,123,10],[123,11,123,12],[123,13,123,14],[117,1,117,2],[117,5,117,6],[117,7,117,8],[117,9,117,10],[117,11,117,12],[117,13,117,14],[116,1,116,2],[116,5,116,6],[118,1,118,2],[118,5,118,6],[118,7,118,8],[118,9,118,10],[118,11,118,12],[118,13,118,14],[110,13,110,14],[111,1,111,2],[111,5,111,6],[111,7,111,8],[111,9,111,10],[111,11,111,12],[111,13,111,14],[116,7,116,8],[116,9,116,10],[116,11,116,12],[116,13,116,14],[112,1,112,2],[112,5,112,6],[112,7,112,8],[112,9,112,10],[112,11,112,12],[110,1,110,2],[110,5,110,6],[110,7,110,8],[110,9,110,10],[110,11,110,12],[112,13,112,14],[113,1,113,2],[113,5,113,6],[108,13,108,14],[109,1,109,2],[109,5,109,6],[109,7,109,8],[109,9,109,10],[109,11,109,12],[109,13,109,14],[108,1,108,2],[108,5,108,6],[108,11,108,12],[100,0,100,2],[101,0,101,2],[102,7,102,8],[102,9,102,10],[103,7,103,8],[103,9,103,10],[102,0,102,2],[103,0,103,2],[108,7,108,8],[108,9,108,10],[106,1,106,2],[106,5,106,6],[105,1,105,2],[105,5,105,6],[104,0,104,2],[107,1,107,2],[107,5,107,6],[84,7,84,8],[84,9,84,10],[85,7,85,8],[85,9,85,10],[86,7,86,8],[86,9,86,10],[87,7,87,8],[87,9,87,10],[92,7,92,8],[92,9,92,10],[68,7,68,8],[68,9,68,10],[69,7,69,8],[69,9,69,10],[70,7,70,8],[70,9,70,10],[71,7,71,8],[71,9,71,10],[64,7,64,8],[64,9,64,10],[67,7,67,8],[67,9,67,10],[65,7,65,8],[65,9,65,10],[66,7,66,8],[66,9,66,10],[60,7,60,8],[60,9,60,10],[61,7,61,8],[61,9,61,10],[62,7,62,8],[62,9,62,10],[54,7,54,8],[54,9,54,10],[51,7,51,8],[51,9,51,10],[52,7,52,8],[52,9,52,10],[53,7,53,8],[53,9,53,10],[55,7,55,8],[55,9,55,10],[59,7,59,8],[59,9,59,10],[56,7,56,8],[56,9,56,10],[57,7,57,8],[57,9,57,10],[58,7,58,8],[58,9,58,10],[58,23,58,24],[58,26,58,27],[58,38,58,40],[58,41,58,42],[30,3,42,3],[55,23,55,24],[55,26,55,27],[21,9,21,17],[15,2,15,6],[15,9,15,17],[16,2,16,6],[16,9,16,17],[17,2,17,6],[19,9,19,17],[20,9,20,17],[19,2,19,6],[24,0,24,19],[25,0,28,19],[22,9,22,17],[30,16,30,19],[29,0,29,10],[45,9,45,10],[55,38,55,40],[20,4,20,8],[55,41,55,42],[56,23,56,24],[56,26,56,27],[56,38,56,40],[56,41,56,42],[57,23,57,24],[57,26,57,27],[57,38,57,40],[57,41,57,42],[52,26,52,27],[52,38,52,40],[52,41,52,42],[53,23,53,24],[53,26,53,27],[53,38,53,40],[53,41,53,42],[54,23,54,24],[54,26,54,27],[54,38,54,40],[54,41,54,42],[52,23,52,24],[49,26,49,27],[49,38,49,40],[49,41,49,42],[50,23,50,24],[50,26,50,27],[50,38,50,40],[50,41,50,42],[51,23,51,24],[51,26,51,27],[51,38,51,40],[51,41,51,42],[46,26,46,27],[46,38,46,40],[46,41,46,42],[47,23,47,24],[47,26,47,27],[47,38,47,40],[47,41,47,42],[48,23,48,24],[48,26,48,27],[48,38,48,40],[48,41,48,42],[44,26,44,27],[44,28,44,29],[44,30,44,31],[44,34,44,35],[44,38,44,40],[44,41,44,42],[45,28,45,29],[45,30,45,31],[45,34,45,35],[45,38,45,40],[45,41,45,42],[30,25,43,25],[30,26,42,27],[30,37,30,42],[31,28,43,29],[31,30,43,31],[31,32,43,33],[31,34,43,35],[31,36,43,37],[31,38,43,39],[31,40,43,40],[31,41,43,41],[31,42,43,42],[43,26,43,27],[43,21,53,22],[30,23,43,24],[31,17,43,17],[48,7,48,8],[48,9,48,10],[49,7,49,8],[49,9,49,10],[47,7,47,8],[47,9,47,10],[50,7,50,8],[50,9,50,10],[44,23,44,24],[46,23,46,24],[49,23,49,24],[46,7,46,8],[46,9,46,10],[31,15,43,15],[31,16,43,16],[45,7,45,8],[31,18,43,18],[31,19,43,19],[63,7,63,8],[63,9,63,10],[80,7,80,8],[80,9,80,10],[83,7,83,8],[83,9,83,10],[81,7,81,8],[81,9,81,10],[82,7,82,8],[82,9,82,10],[72,7,72,8],[72,9,72,10],[75,7,75,8],[75,9,75,10],[73,7,73,8],[73,9,73,10],[74,7,74,8],[74,9,74,10],[76,7,76,8],[76,9,76,10],[77,7,77,8],[77,9,77,10],[78,7,78,8],[78,9,78,10],[79,7,79,8],[79,9,79,10],[96,7,96,8],[96,9,96,10],[99,7,99,8],[99,9,99,10],[97,7,97,8],[97,9,97,10],[98,7,98,8],[98,9,98,10],[88,7,88,8],[88,9,88,10],[91,7,91,8],[91,9,91,10],[89,7,89,8],[89,9,89,10],[90,7,90,8],[90,9,90,10],[93,7,93,8],[93,9,93,10],[94,7,94,8],[94,9,94,10],[95,7,95,8],[95,9,95,10],[107,13,107,14],[105,7,105,8],[105,9,105,10],[105,11,105,12],[105,13,105,14],[100,7,100,8],[100,9,100,10],[101,7,101,8],[101,9,101,10],[106,7,106,8],[106,9,106,10],[106,11,106,12],[106,13,106,14],[104,7,104,8],[104,9,104,10],[107,7,107,8],[107,9,107,10],[107,11,107,12],[115,1,115,2],[115,5,115,6],[115,7,115,8],[115,9,115,10],[115,11,115,12],[115,13,115,14],[113,7,113,8],[113,9,113,10],[113,11,113,12],[113,13,113,14],[114,1,114,2],[114,5,114,6],[114,7,114,8],[114,9,114,10],[114,11,114,12],[114,13,114,14],[121,7,121,8],[121,9,121,10],[121,11,121,12],[121,13,121,14],[122,1,122,2],[122,5,122,6],[122,7,122,8],[122,9,122,10],[122,11,122,12],[122,13,122,14],[128,13,128,14],[129,1,129,2],[129,5,129,6],[131,1,131,2],[131,5,131,6],[131,7,131,8],[131,9,131,10],[131,11,131,12],[131,13,131,14],[129,7,129,8],[129,9,129,10],[129,11,129,12],[129,13,129,14],[130,1,130,2],[130,5,130,6],[130,7,130,8],[130,9,130,10],[130,11,130,12],[130,13,130,14],[136,13,136,14],[137,1,137,2],[137,5,137,6],[137,7,137,8],[137,9,137,10],[137,11,137,12],[137,13,137,14],[44,0,44,2],[30,7,31,8],[30,9,31,10],[32,7,43,8],[32,9,43,10],[44,9,44,10],[44,7,44,8],[30,4,31,6],[32,4,43,4],[32,5,43,6],[31,11,43,11],[31,12,43,12],[31,13,43,13],[31,14,43,14],[30,11,30,15],[45,0,45,2],[46,0,46,2],[69,0,69,2],[70,0,70,2],[47,0,47,2],[48,0,48,2],[49,0,49,2],[50,0,50,2],[51,0,51,2],[52,0,52,2],[53,0,53,2],[54,0,54,2],[55,0,55,2],[99,0,99,2],[88,0,88,2],[89,0,89,2],[90,0,90,2],[73,0,73,2],[74,0,74,2],[75,0,75,2],[76,0,76,2],[77,0,77,2],[78,0,78,2],[79,0,79,2],[80,0,80,2],[81,0,81,2],[82,0,82,2],[83,0,83,2],[84,0,84,2],[85,0,85,2],[86,0,86,2],[87,0,87,2],[30,0,42,2],[91,0,91,2],[92,0,92,2],[93,0,93,2],[94,0,94,2],[95,0,95,2],[96,0,96,2],[97,0,97,2],[98,0,98,2],[56,0,56,2],[57,0,57,2],[58,0,58,2],[59,0,59,2],[60,0,60,2],[61,0,61,2],[62,0,62,2],[71,0,71,2],[72,0,72,2],[63,0,63,2],[64,0,64,2],[65,0,65,2],[66,0,66,2],[67,0,67,2],[68,0,68,2]]}
[]
["Analyserekvisition LUFT, ATD-RØR"]
[]
["Sagsnr.:",null,{"$f":"IF('1. Stamdata'!D22=\"\",\"\",'1. Stamdata'!D22)","v":""},null,null,"Lokalitetsnr.:",null,null,null,{"$f":"IF('1. Stamdata'!N22=\"\",\"\",'1. Stamdata'!N22)","v":""}]
["Lokalitetsnavn:",null,{"$f":"IF('1. Stamdata'!D23=\"\",\"\",'1. Stamdata'!D23)","v":""},null,null,null,null,null,null,null,null,"Region:",null,null,{"$f":"IF('1. Stamdata'!Q23=\"\",\"\",'1. Stamdata'!Q23)","v":""}]
[]
[]
["Prøvetager:",null,null,null,null,null,null,null,null,"Analysetid:"]
[]
["Udtagningsdato:",null,null,null,null,null,null,null,null,"Normal"]
["Indleveringsdato:"]
["Rekvisitionsdato:"]
[]
[null,null,"Rapportmodtager:",null,null,null,null,null,null,"Fakturamodtager:"]
[{"$f":"'1. Stamdata'!$B$26","v":"Firma:"},null,{"$f":"IF('1. Stamdata'!D26=\"\",\"\",'1. Stamdata'!D26)","v":""},null,null,null,null,null,null,{"$f":"IF('1. Stamdata'!M26=\"\",\"\",'1. Stamdata'!M26)","v":""}]
[{"$f":"'1. Stamdata'!$B$27","v":"Adresse:"},null,{"$f":"IF('1. Stamdata'!D27=\"\",\"\",'1. Stamdata'!D27)","v":""},null,null,null,null,null,null,{"$f":"IF('1. Stamdata'!M27=\"\",\"\",'1. Stamdata'!M27)","v":""}]
[{"$f":"'1. Stamdata'!$B$28","v":"Postnr./By:"},null,{"$f":"IF('1. Stamdata'!D28=\"\",\"\",'1. Stamdata'!D28)","v":""},null,null,null,null,null,null,{"$f":"IF('1. Stamdata'!M28=\"\",\"\",'1. Stamdata'!M28)","v":""}]
[{"$f":"'1. Stamdata'!$B$29","v":"Kontaktperson:"},null,{"$f":"IF('1. Stamdata'!D29=\"\",\"\",'1. Stamdata'!D29)","v":""},null,null,null,null,null,null,{"$f":"IF('1. Stamdata'!M29=\"\",\"\",'1. Stamdata'!M29)","v":""}]
[{"$f":"'1. Stamdata'!$B$30","v":"Telefonnummer:"},null,{"$f":"IF('1. Stamdata'!D30=\"\",\"\",'1. Stamdata'!D30)","v":""},null,null,null,null,null,null,{"$f":"IF('1. Stamdata'!M30=\"\",\"\",'1. Stamdata'!M30)","v":""}]
[{"$f":"'1. Stamdata'!$B31","v":"E-mail | EAN:"},null,{"$f":"IF('1. Stamdata'!D31=\"\",\"\",'1. Stamdata'!D31)","v":""},null,null,null,null,null,null,{"$f":"IF('1. Stamdata'!M31=\"\",\"\",'1. Stamdata'!M31)","v":""}]
[{"$f":"'1. Stamdata'!$B32","v":"Personreference:"},null,{"$f":"IF('1. Stamdata'!D32=\"\",\"\",'1. Stamdata'!D32)","v":""},null,null,null,null,null,null,{"$f":"IF('1. Stamdata'!M32=\"\",\"\",'1. Stamdata'!M32)","v":""}]
[{"$f":"'1. Stamdata'!$B33","v":"Fakturareference:"},null,null,null,null,null,null,null,null,{"$f":"IF('1. Stamdata'!M33=\"\",\"\",'1. Stamdata'!M33)","v":""}]
[{"$f":"'1. Stamdata'!$B34","v":"Fakturering:"},null,null,null,null,null,null,null,null,{"$f":"IF('1. Stamdata'!M34=\"\",\"\",'1. Stamdata'!M34)","v":"Månedlig samlefaktura (A)"}]
[]
["Bemærkninger:"]
[]
[]
[]
[]
["Optælling",null,null,null,null,null,null,null,null,null,null,{"$f":"COUNTA(L45:L105)","v":0},{"$f":"COUNTA(M45:M105)","v":0},0,0,0,0,0,0,0]
["Rekvisition udfyldes med\nét ATD-rør pr. linje",null,null,"Forbeholdt ALS","Udstyr",null,null,"Passiv måling",null,"Aktiv måling",null,"Analyser",null,null,null,null,"Andet"]
[null,null,null,null,null,null,null,null,null,null,null,"ATD-rør, vinylchlorid (5799)"]
[null,null,null,null,"H-rør","R-rør",null,"Opsamlingstid (min)",null,"Luftvolume (l)"]
[]
[]
[]
[]
[]
[]
[]
[]
[]
[]
["PrøvestedID",null,null,"Labnr."]

{"sheet":"8. Luft-Canister","index":7,"n_rows":45,"n_cols":20,"rows_kept":45,"cut":false,"hidden":false,"merged":[[11,9,12,19],[14,2,14,6],[14,9,14,17],[15,2,15,6],[15,9,15,17],[1,0,2,19],[3,2,3,4],[3,9,3,18],[8,15,8,16],[8,17,8,18],[10,2,10,5],[11,2,11,5],[4,11,4,13],[4,14,4,18],[4,2,4,10],[7,2,7,5],[9,2,9,5],[19,2,19,6],[19,9,19,17],[20,9,20,17],[21,9,21,17],[22,9,22,17],[16,2,16,6],[16,9,16,17],[17,2,17,6],[17,9,17,17],[18,2,18,6],[18,9,18,17],[20,4,20,8],[21,4,21,8],[22,4,22,8],[48,41,48,42],[24,0,24,19],[25,0,28,19],[29,4,29,6],[29,7,29,14],[30,0,43,0],[30,1,43,2],[30,3,42,3],[30,4,30,6],[30,7,30,14],[30,15,30,16],[30,17,30,19],[44,34,44,35],[30,23,43,24],[30,25,43,25],[30,26,42,27],[30,37,30,42],[31,4,43,4],[31,5,43,6],[31,7,43,8],[31,9,43,10],[31,11,43,12],[31,40,43,40],[31,41,43,41],[31,42,43,42],[43,21,53,22],[43,26,43,27],[31,36,43,37],[31,38,43,39],[44,38,44,40],[44,41,44,42],[45,34,45,35],[45,38,45,40],[45,41,45,42],[46,41,46,42],[47,41,47,42],[31,28,43,29],[31,30,43,31],[31,32,43,33],[31,34,43,35],[45,28,45,29],[45,30,45,31],[44,23,44,24],[44,26,44,27],[44,28,44,29],[44,30,44,31],[49,41,49,42],[50,41,50,42],[31,13,43,14],[31,15,43,15],[31,16,43,16],[31,17,43,17],[31,18,43,18],[31,19,43,19],[45,1,45,2],[45,5,45,6],[45,7,45,8],[45,9,45,10],[45,11,45,12],[45,13,45,14],[44,13,44,14],[44,1,44,2],[44,5,44,6],[44,7,44,8],[44,9,44,10],[44,11,44,12],[46,1,46,2],[46,5,46,6],[46,7,46,8],[46,9,46,10],[46,11,46,12],[46,13,46,14],[46,23,46,24],[46,26,46,27],[46,38,46,40],[47,1,47,2],[47,5,47,6],[47,7,47,8],[47,9,47,10],[47,11,47,12],[47,13,47,14],[47,23,47,24],[47,26,47,27],[47,38,47,40],[48,1,48,2],[48,5,48,6],[48,7,48,8],[48,9,48,10],[48,11,48,12],[48,13,48,14],[48,23,48,24],[48,26,48,27],[48,38,48,40],[50,1,50,2],[50,5,50,6],[50,7,50,8],[50,9,50,10],[50,11,50,12],[50,13,50,14],[50,23,50,24],[50,26,50,27],[50,38,50,40],[49,1,49,2],[49,5,49,6],[49,7,49,8],[49,9,49,10],[49,11,49,12],[49,13,49,14],[49,23,49,24],[49,26,49,27],[49,38,49,40],[51,41,51,42],[52,1,52,2],[52,5,52,6],[52,7,52,8],[52,9,52,10],[52,11,52,12],[52,13,52,14],[52,23,52,24],[52,26,52,27],[52,38,52,40],[52,41,52,42],[51,1,51,2],[51,5,51,6],[51,7,51,8],[51,9,51,10],[51,11,51,12],[51,13,51,14],[51,23,51,24],[51,26,51,27],[51,38,51,40],[53,41,53,42],[54,1,54,2],[54,5,54,6],[54,7,54,8],[54,9,54,10],[54,11,54,12],[54,13,54,14],[54,23,54,24],[54,26,54,27],[54,38,54,40],[54,41,54,42],[53,1,53,2],[53,5,53,6],[53,7,53,8],[53,9,53,10],[53,11,53,12],[53,13,53,14],[53,23,53,24],[53,26,53,27],[53,38,53,40],[55,41,55,42],[56,1,56,2],[56,5,56,6],[56,7,56,8],[56,9,56,10],[56,11,56,12],[56,13,56,14],[56,23,56,24],[56,26,56,27],[56,38,56,40],[56,41,56,42],[55,1,55,2],[55,5,55,6],[55,7,55,8],[55,9,55,10],[55,11,55,12],[55,13,55,14],[55,23,55,24],[55,26,55,27],[55,38,55,40],[57,41,57,42],[58,1,58,2],[58,5,58,6],[58,7,58,8],[58,9,58,10],[58,11,58,12],[58,13,58,14],[58,23,58,24],[58,26,58,27],[58,38,58,40],[58,41,58,42],[57,1,57,2],[57,5,57,6],[57,7,57,8],[57,9,57,10],[57,11,57,12],[57,13,57,14],[57,23,57,24],[57,26,57,27],[57,38,57,40],[59,1,59,2],[59,5,59,6],[59,7,59,8],[59,9,59,10],[59,11,59,12],[59,13,59,14],[61,1,61,2],[61,5,61,6],[61,7,61,8],[61,9,61,10],[61,11,61,12],[61,13,61,14],[60,1,60,2],[60,5,60,6],[60,7,60,8],[60,9,60,10],[60,11,60,12],[60,13,60,14],[63,1,63,2],[63,5,63,6],[63,7,63,8],[63,9,63,10],[63,11,63,12],[63,13,63,14],[62,1,62,2],[62,5,62,6],[62,7,62,8],[62,9,62,10],[62,11,62,12],[62,13,62,14],[65,1,65,2],[65,5,65,6],[65,7,65,8],[65,9,65,10],[65,11,65,12],[65,13,65,14],[64,1,64,2],[64,5,64,6],[64,7,64,8],[64,9,64,10],[64,11,64,12],[64,13,64,14],[67,1,67,2],[67,5,67,6],[67,7,67,8],[67,9,67,10],[67,11,67,12],[67,13,67,14],[66,1,66,2],[66,5,66,6],[66,7,66,8],[66,9,66,10],[66,11,66,12],[66,13,66,14],[69,1,69,2],[69,5,69,6],[69,7,69,8],[69,9,69,10],[69,11,69,12],[69,13,69,14],[68,1,68,2],[68,5,68,6],[68,7,68,8],[68,9,68,10],[68,11,68,12],[68,13,68,14],[71,1,71,2],[71,5,71,6],[71,7,71,8],[71,9,71,10],[71,11,71,12],[71,13,71,14],[70,1,70,2],[70,5,70,6],[70,7,70,8],[70,9,70,10],[70,11,70,12],[70,13,70,14],[73,1,73,2],[73,5,73,6],[73,7,73,8],[73,9,73,10],[73,11,73,12],[73,13,73,14],[72,1,72,2],[72,5,72,6],[72,7,72,8],[72,9,72,10],[72,11,72,12],[72,13,72,14],[75,1,75,2],[75,5,75,6],[75,7,75,8],[75,9,75,10],[75,11,75,12],[75,13,75,14],[74,1,74,2],[74,5,74,6],[74,7,74,8],[74,9,74,10],[74,11,74,12],[74,13,74,14],[77,1,77,2],[77,5,77,6],[77,7,77,8],[77,9,77,10],[77,11,77,12],[77,13,77,14],[76,1,76,2],[76,5,76,6],[76,7,76,8],[76,9,76,10],[76,11,76,12],[76,13,76,14],[79,1,79,2],[79,5,79,6],[79,7,79,8],[79,9,79,10],[79,11,79,12],[79,13,79,14],[78,1,78,2],[78,5,78,6],[78,7,78,8],[78,9,78,10],[78,11,78,12],[78,13,78,14],[81,1,81,2],[81,5,81,6],[81,7,81,8],[81,9,81,10],[81,11,81,12],[81,13,81,14],[80,1,80,2],[80,5,80,6],[80,7,80,8],[80,9,80,10],[80,11,80,12],[80,13,80,14],[83,1,83,2],[83,5,83,6],[83,7,83,8],[83,9,83,10],[83,11,83,12],[83,13,83,14],[82,1,82,2],[82,5,82,6],[82,7,82,8],[82,9,82,10],[82,11,82,12],[82,13,82,14],[85,1,85,2],[85,5,85,6],[85,7,85,8],[85,9,85,10],[85,11,85,12],[85,13,85,14],[84,1,84,2],[84,5,84,6],[84,7,84,8],[84,9,84,10],[84,11,84,12],[84,13,84,14],[87,1,87,2],[87,5,87,6],[87,7,87,8],[87,9,87,10],[87,11,87,12],[87,13,87,14],[86,1,86,2],[86,5,86,6],[86,7,86,8],[86,9,86,10],[86,11,86,12],[86,13,86,14],[89,1,89,2],[89,5,89,6],[89,7,89,8],[89,9,89,10],[89,11,89,12],[89,13,89,14],[88,1,88,2],[88,5,88,6],[88,7,88,8],[88,9,88,10],[88,11,88,12],[88,13,88,14],[91,1,91,2],[91,5,91,6],[91,7,91,8],[91,9,91,10],[91,11,91,12],[91,13,91,14],[90,1,90,2],[90,5,90,6],[90,7,90,8],[90,9,90,10],[90,11,90,12],[90,13,90,14],[93,1,93,2],[93,5,93,6],[93,7,93,8],[93,9,93,10],[93,11,93,12],[93,13,93,14],[92,1,92,2],[92,5,92,6],[92,7,92,8],[92,9,92,10],[92,11,92,12],[92,13,92,14],[95,1,95,2],[95,5,95,6],[95,7,95,8],[95,9,95,10],[95,11,95,12],[95,13,95,14],[94,1,94,2],[94,5,94,6],[94,7,94,8],[94,9,94,10],[94,11,94,12],[94,13,94,14],[97,1,97,2],[97,5,97,6],[97,7,97,8],[97,9,97,10],[97,11,97,12],[97,13,97,14],[96,1,96,2],[96,5,96,6],[96,7,96,8],[96,9,96,10],[96,11,96,12],[96,13,96,14],[99,1,99,2],[99,5,99,6],[99,7,99,8],[99,9,99,10],[99,11,99,12],[99,13,99,14],[98,1,98,2],[98,5,98,6],[98,7,98,8],[98,9,98,10],[98,11,98,12],[98,13,98,14],[101,1,101,2],[101,5,101,6],[101,7,101,8],[101,9,101,10],[101,11,101,12],[101,13,101,14],[100,1,100,2],[100,5,100,6],[100,7,100,8],[100,9,100,10],[100,11,100,12],[100,13,100,14],[103,1,103,2],[103,5,103,6],[103,7,103,8],[103,9,103,10],[103,11,103,12],[103,13,103,14],[102,1,102,2],[102,5,102,6],[102,7,102,8],[102,9,102,10],[102,11,102,12],[102,13,102,14],[105,1,105,2],[105,5,105,6],[105,7,105,8],[105,9,105,10],[105,11,105,12],[105,13,105,14],[104,1,104,2],[104,5,104,6],[104,7,104,8],[104,9,104,10],[104,11,104,12],[104,13,104,14],[107,1,107,2],[107,5,107,6],[107,7,107,8],[107,9,107,10],[107,11,107,12],[107,13,107,14],[106,1,106,2],[106,5,106,6],[106,7,106,8],[106,9,106,10],[106,11,106,12],[106,13,106,14],[109,1,109,2],[109,5,109,6],[109,7,109,8],[109,9,109,10],[109,11,109,12],[109,13,109,14],[108,1,108,2],[108,5,108,6],[108,7,108,8],[108,9,108,10],[108,11,108,12],[108,13,108,14],[111,1,111,2],[111,5,111,6],[111,7,111,8],[111,9,111,10],[111,11,111,12],[111,13,111,14],[110,1,110,2],[110,5,110,6],[110,7,110,8],[110,9,110,10],[110,11,110,12],[110,13,110,14],[113,1,113,2],[113,5,113,6],[113,7,113,8],[113,9,113,10],[113,11,113,12],[113,13,113,14],[112,1,112,2],[112,5,112,6],[112,7,112,8],[112,9,112,10],[112,11,112,12],[112,13,112,14],[115,1,115,2],[115,5,115,6],[115,7,115,8],[115,9,115,10],[115,11,115,12],[115,13,115,14],[114,1,114,2],[114,5,114,6],[114,7,114,8],[114,9,114,10],[114,11,114,12],[114,13,114,14],[117,1,117,2],[117,5,117,6],[117,7,117,8],[117,9,117,10],[117,11,117,12],[117,13,117,14],[116,1,116,2],[116,5,116,6],[116,7,116,8],[116,9,116,10],[116,11,116,12],[116,13,116,14],[119,1,119,2],[119,5,119,6],[119,7,119,8],[119,9,119,10],[119,11,119,12],[119,13,119,14],[118,1,118,2],[118,5,118,6],[118,7,118,8],[118,9,118,10],[118,11,118,12],[118,13,118,14],[121,1,121,2],[121,5,121,6],[121,7,121,8],[121,9,121,10],[121,11,121,12],[121,13,121,14],[120,1,120,2],[120,5,120,6],[120,7,120,8],[120,9,120,10],[120,11,120,12],[120,13,120,14],[123,1,123,2],[123,5,123,6],[123,7,123,8],[123,9,123,10],[123,11,123,12],[123,13,123,14],[122,1,122,2],[122,5,122,6],[122,7,122,8],[122,9,122,10],[122,11,122,12],[122,13,122,14],[125,1,125,2],[125,5,125,6],[125,7,125,8],[125,9,125,10],[125,11,125,12],[125,13,125,14],[124,1,124,2],[124,5,124,6],[124,7,124,8],[124,9,124,10],[124,11,124,12],[124,13,124,14],[127,1,127,2],[127,5,127,6],[127,7,127,8],[127,9,127,10],[127,11,127,12],[127,13,127,14],[126,1,126,2],[126,5,126,6],[126,7,126,8],[126,9,126,10],[126,11,126,12],[126,13,126,14],[129,1,129,2],[129,5,129,6],[129,7,129,8],[129,9,129,10],[129,11,129,12],[129,13,129,14],[128,1,128,2],[128,5,128,6],[128,7,128,8],[128,9,128,10],[128,11,128,12],[128,13,128,14],[131,1,131,2],[131,5,131,6],[131,7,131,8],[131,9,131,10],[131,11,131,12],[131,13,131,14],[130,1,130,2],[130,5,130,6],[130,7,130,8],[130,9,130,10],[130,11,130,12],[130,13,130,14],[133,1,133,2],[133,5,133,6],[133,7,133,8],[133,9,133,10],[133,11,133,12],[133,13,133,14],[132,1,132,2],[132,5,132,6],[132,7,132,8],[132,9,132,10],[132,11,132,12],[132,13,132,14],[135,1,135,2],[135,5,135,6],[135,7,135,8],[135,9,135,10],[135,11,135,12],[135,13,135,14],[134,1,134,2],[134,5,134,6],[134,7,134,8],[134,9,134,10],[134,11,134,12],[134,13,134,14],[137,1,137,2],[137,5,137,6],[137,7,137,8],[137,9,137,10],[137,11,137,12],[137,13,137,14],[136,1,136,2],[136,5,136,6],[136,7,136,8],[136,9,136,10],[136,11,136,12],[136,13,136,14],[139,1,139,2],[139,5,139,6],[139,7,139,8],[139,9,139,10],[139,11,139,12],[139,13,139,14],[138,1,138,2],[138,5,138,6],[138,7,138,8],[138,9,138,10],[138,11,138,12],[138,13,138,14],[141,1,141,2],[141,5,141,6],[141,7,141,8],[141,9,141,10],[141,11,141,12],[141,13,141,14],[140,1,140,2],[140,5,140,6],[140,7,140,8],[140,9,140,10],[140,11,140,12],[140,13,140,14],[143,1,143,2],[143,5,143,6],[143,7,143,8],[143,9,143,10],[143,11,143,12],[143,13,143,14],[142,1,142,2],[142,5,142,6],[142,7,142,8],[142,9,142,10],[142,11,142,12],[142,13,142,14]]}
[]
["Analyserekvisition LUFT, CANISTER"]
[]
["Sagsnr.:",null,{"$f":"IF('1. Stamdata'!D22=\"\",\"\",'1. Stamdata'!D22)","v":""},null,null,"Lokalitetsnr.:",null,null,null,{"$f":"IF('1. Stamdata'!N22=\"\",\"\",'1. Stamdata'!N22)","v":""}]
["Lokalitetsnavn:",null,{"$f":"IF('1. Stamdata'!D23=\"\",\"\",'1. Stamdata'!D23)","v":""},null,null,null,null,null,null,null,null,"Region:",null,null,{"$f":"IF('1. Stamdata'!Q23=\"\",\"\",'1. Stamdata'!Q23)","v":""}]
[]
[]
["Prøvetager:",null,null,null,null,null,null,null,null,"Analysetid*:"]
[null,null,null,null,null,null,null,null,null,"Normal"]
["Udtagningsdato:"]
["Indleveringsdato:"]
["Rekvisitionsdato:",null,null,null,null,null,null,null,null,"*Analysetid regnes efter ankomst af canister til ALS USA"]
[]
[null,null,"Rapportmodtager:",null,null,null,null,null,null,"Fakturamodtager:"]
[{"$f":"'1. Stamdata'!$B$26","v":"Firma:"},null,{"$f":"IF('1. Stamdata'!D26=\"\",\"\",'1. Stamdata'!D26)","v":""},null,null,null,null,null,null,{"$f":"IF('1. Stamdata'!M26=\"\",\"\",'1. Stamdata'!M26)","v":""}]
[{"$f":"'1. Stamdata'!$B$27","v":"Adresse:"},null,{"$f":"IF('1. Stamdata'!D27=\"\",\"\",'1. Stamdata'!D27)","v":""},null,null,null,null,null,null,{"$f":"IF('1. Stamdata'!M27=\"\",\"\",'1. Stamdata'!M27)","v":""}]
[{"$f":"'1. Stamdata'!$B$28","v":"Postnr./By:"},null,{"$f":"IF('1. Stamdata'!D28=\"\",\"\",'1. Stamdata'!D28)","v":""},null,null,null,null,null,null,{"$f":"IF('1. Stamdata'!M28=\"\",\"\",'1. Stamdata'!M28)","v":""}]
[{"$f":"'1. Stamdata'!$B$29","v":"Kontaktperson:"},null,{"$f":"IF('1. Stamdata'!D29=\"\",\"\",'1. Stamdata'!D29)","v":""},null,null,null,null,null,null,{"$f":"IF('1. Stamdata'!M29=\"\",\"\",'1. Stamdata'!M29)","v":""}]
[{"$f":"'1. Stamdata'!$B$30","v":"Telefonnummer:"},null,{"$f":"IF('1. Stamdata'!D30=\"\",\"\",'1. Stamdata'!D30)","v":""},null,null,null,null,null,null,{"$f":"IF('1. Stamdata'!M30=\"\",\"\",'1. Stamdata'!M30)","v":""}]
[{"$f":"'1. Stamdata'!$B31","v":"E-mail | EAN:"},null,{"$f":"IF('1. Stamdata'!D31=\"\",\"\",'1. Stamdata'!D31)","v":""},null,null,null,null,null,null,{"$f":"IF('1. Stamdata'!M31=\"\",\"\",'1. Stamdata'!M31)","v":""}]
[{"$f":"'1. Stamdata'!$B32","v":"Personreference:"},null,{"$f":"IF('1. Stamdata'!D32=\"\",\"\",'1. Stamdata'!D32)","v":""},null,null,null,null,null,null,{"$f":"IF('1. Stamdata'!M32=\"\",\"\",'1. Stamdata'!M32)","v":""}]
[{"$f":"'1. Stamdata'!$B33","v":"Fakturareference:"},null,null,null,null,null,null,null,null,{"$f":"IF('1. Stamdata'!M33=\"\",\"\",'1. Stamdata'!M33)","v":""}]
[{"$f":"'1. Stamdata'!$B34","v":"Fakturering:"},null,null,null,null,null,null,null,null,{"$f":"IF('1. Stamdata'!M34=\"\",\"\",'1. Stamdata'!M34)","v":"Månedlig samlefaktura (A)"}]
[]
["Bemærkninger:"]
[]
[]
[]
[]
["Optælling",null,null,null,null,null,null,null,null,null,null,null,null,null,null,null,null,{"$f":"COUNTA(R46:R144)","v":0},{"$f":"COUNTA(S46:S144)","v":0},{"$f":"COUNTA(T46:T144)","v":0}]
["Prøve ID \n(Client Sample ID)","Måletype:\nPoreluft (P), Indeklima (I), Udeluft (U)",null,"Forbeholdt ALS","Udstyr",null,null,"Prøvetagningsperiode",null,null,null,null,null,null,null,"Tryk",null,"Analyser"]
[null,null,null,null,"Canister ID (ASXXXXX , SCXXXXX)","Flow Controller ID (FCXXXXXX)",null,"Prøvetagning, start (dato)",null,"Prøvetagning, start (tidspunkt)",null,"Prøvetagning, slut (dato)",null,"Prøvetagning, slut (tidspunkt)",null,"Canistertryk, start (Hg/psig)","Canistertryk, slut (Hg/psig)","Chlorerede opl. og nedbrydning (6629)","SCAN 75 VOC-stoffer (9430,00)","Individuel certificering (9430,51)"]
[]
[]
[]
[]
[]
[]
[]
[]
[]
[]
[]
[null,null,null,"Labnr."]
["Eksempel","I",null,null,"SC00431","FCR00366",null,"DD.MM.ÅÅ",null,"TT:MM",null,"DD.MM.ÅÅ",null,"TT:MM",null,30,3,"x",null,"x"]

{"sheet":"Fakurering","index":8,"n_rows":2,"n_cols":1,"rows_kept":2,"cut":false,"hidden":true,"merged":[]}
["Hurtigst muligt (D)"]
["Ugentlig samlefaktura (J)"]

{"sheet":"Klassifikation","index":9,"n_rows":5,"n_cols":1,"rows_kept":5,"cut":false,"hidden":true,"merged":[]}
["Sjælland"]
["Sjælland med kl. 0"]
["Aarhus"]
["Nordjylland"]
["Bekendtgørelse 1479, juli 2010"]